{"text_format":"1","workbook":"xlsx","n_sheets":3,"sheets":["設定","カレンダー","祝日"],"not_rendered":{"charts":0,"images":1,"macros":1,"external_links":0,"defined_names":2,"comments":0,"pivot_tables":0},"unopened":[],"bounds":{"document_bytes":16777216,"sheet_cells":100000,"rows_first":2000,"rows_last":500,"rows_between":2000,"halvings":0,"cell_chars":16384,"cell_head_chars":4096},"cells_cut":0,"cells_raw":0,"read":"whole","date_system":"1900"}

{"sheet":"設定","index":0,"n_rows":14,"n_cols":3,"rows_kept":14,"cut":false,"hidden":false,"merged":[[2,1,2,2],[1,1,1,2]]}
[null,"設定"]
[null,"以下の2項目の設定を行い、入力後に [決定] ボタンをクリックしてください。\n設定内容が、カレンダーに反映されます。"]
[]
[null,"以下に開始年と月を入力してください。"]
[null,"開始年",2021]
[null,"開始月",1]
[null,"開始曜日","月"]
[]
[null,"家族カレンダー上でタスク分けを\n行いたい家族メンバーを入力してください。\n※メンバーは最大5名登録ができます。"]
[null,"家族メンバー1","パパ"]
[null,"家族メンバー2","ママ"]
[null,"家族メンバー3","さとる"]
[null,"家族メンバー4","くるみ"]
[null,"家族メンバー5","ともか"]

{"sheet":"カレンダー","index":1,"n_rows":624,"n_cols":15,"rows_kept":624,"cut":false,"hidden":false,"merged":[[44,11,44,12],[44,13,44,14],[96,1,96,2],[96,3,96,4],[96,5,96,6],[96,7,96,8],[96,9,96,10],[96,11,96,12],[96,13,96,14],[88,11,88,12],[88,13,88,14],[88,1,88,2],[88,3,88,4],[88,5,88,6],[88,7,88,8],[88,9,88,10],[72,11,72,12],[72,13,72,14],[80,1,80,2],[80,3,80,4],[80,5,80,6],[80,7,80,8],[80,9,80,10],[80,11,80,12],[44,1,44,2],[44,3,44,4],[44,5,44,6],[44,7,44,8],[44,9,44,10],[584,1,584,2],[584,3,584,4],[584,5,584,6],[584,7,584,8],[584,9,584,10],[573,1,573,2],[574,1,574,3],[576,1,576,2],[576,3,576,4],[576,5,576,6],[576,7,576,8],[576,9,576,10],[496,1,496,2],[496,3,496,4],[496,5,496,6],[524,1,524,2],[524,3,524,4],[524,5,524,6],[524,7,524,8],[584,11,584,12],[584,13,584,14],[608,11,608,12],[608,13,608,14],[608,1,608,2],[608,3,608,4],[608,5,608,6],[608,7,608,8],[608,9,608,10],[592,11,592,12],[592,13,592,14],[600,1,600,2],[600,3,600,4],[600,5,600,6],[600,7,600,8],[600,9,600,10],[600,11,600,12],[600,13,600,14],[592,1,592,2],[592,3,592,4],[592,5,592,6],[592,7,592,8],[592,9,592,10],[548,13,548,14],[556,1,556,2],[556,3,556,4],[556,5,556,6],[556,7,556,8],[556,9,556,10],[556,11,556,12],[556,13,556,14],[548,1,548,2],[548,3,548,4],[548,5,548,6],[548,7,548,8],[548,9,548,10],[576,11,576,12],[576,13,576,14],[532,11,532,12],[532,13,532,14],[540,1,540,2],[540,3,540,4],[540,5,540,6],[540,7,540,8],[540,9,540,10],[540,11,540,12],[540,13,540,14],[532,1,532,2],[532,3,532,4],[532,5,532,6],[532,7,532,8],[532,9,532,10],[564,1,564,2],[564,3,564,4],[564,5,564,6],[564,7,564,8],[564,9,564,10],[564,11,564,12],[564,13,564,14],[548,11,548,12],[524,9,524,10],[524,11,524,12],[524,13,524,14],[504,1,504,2],[504,3,504,4],[504,5,504,6],[504,7,504,8],[504,9,504,10],[512,1,512,2],[512,3,512,4],[512,5,512,6],[512,7,512,8],[512,9,512,10],[512,11,512,12],[512,13,512,14],[488,1,488,2],[488,3,488,4],[488,5,488,6],[488,7,488,8],[488,9,488,10],[504,11,504,12],[504,13,504,14],[521,1,521,2],[522,1,522,3],[480,3,480,4],[480,5,480,6],[480,7,480,8],[480,9,480,10],[480,11,480,12],[480,13,480,14],[488,11,488,12],[488,13,488,14],[496,7,496,8],[496,9,496,10],[496,11,496,12],[496,13,496,14],[444,11,444,12],[444,13,444,14],[452,1,452,2],[452,3,452,4],[452,5,452,6],[452,7,452,8],[452,9,452,10],[452,11,452,12],[452,13,452,14],[444,1,444,2],[444,3,444,4],[444,5,444,6],[444,7,444,8],[444,9,444,10],[428,11,428,12],[428,13,428,14],[436,1,436,2],[436,3,436,4],[436,5,436,6],[436,7,436,8],[436,9,436,10],[436,11,436,12],[436,13,436,14],[428,1,428,2],[428,3,428,4],[428,5,428,6],[428,7,428,8],[428,9,428,10],[400,11,400,12],[400,13,400,14],[417,1,417,2],[418,1,418,3],[420,1,420,2],[420,3,420,4],[420,5,420,6],[420,7,420,8],[420,9,420,10],[420,11,420,12],[420,13,420,14],[400,1,400,2],[400,3,400,4],[400,5,400,6],[400,7,400,8],[400,9,400,10],[408,1,408,2],[408,3,408,4],[408,5,408,6],[408,7,408,8],[408,9,408,10],[408,11,408,12],[408,13,408,14],[392,1,392,2],[392,3,392,4],[392,5,392,6],[392,7,392,8],[392,9,392,10],[392,11,392,12],[392,13,392,14],[384,1,384,2],[384,3,384,4],[384,5,384,6],[384,7,384,8],[384,9,384,10],[376,1,376,2],[376,3,376,4],[376,5,376,6],[376,7,376,8],[376,9,376,10],[376,11,376,12],[376,13,376,14],[384,11,384,12],[384,13,384,14],[365,1,365,2],[366,1,366,3],[368,1,368,2],[368,3,368,4],[368,5,368,6],[340,11,340,12],[340,13,340,14],[348,1,348,2],[348,3,348,4],[348,5,348,6],[348,7,348,8],[348,9,348,10],[348,11,348,12],[348,13,348,14],[340,1,340,2],[340,3,340,4],[340,5,340,6],[340,7,340,8],[340,9,340,10],[368,7,368,8],[368,9,368,10],[368,11,368,12],[368,13,368,14],[356,1,356,2],[324,11,324,12],[324,13,324,14],[332,1,332,2],[332,3,332,4],[332,5,332,6],[332,7,332,8],[332,9,332,10],[332,11,332,12],[332,13,332,14],[324,1,324,2],[324,3,324,4],[324,5,324,6],[324,7,324,8],[324,9,324,10],[296,11,296,12],[296,13,296,14],[313,1,313,2],[314,1,314,3],[316,1,316,2],[316,3,316,4],[316,5,316,6],[316,7,316,8],[316,9,316,10],[316,11,316,12],[316,13,316,14],[296,1,296,2],[296,3,296,4],[296,5,296,6],[296,7,296,8],[296,9,296,10],[288,1,288,2],[288,3,288,4],[288,5,288,6],[288,7,288,8],[288,9,288,10],[288,11,288,12],[288,13,288,14],[280,1,280,2],[280,3,280,4],[280,5,280,6],[280,7,280,8],[280,9,280,10],[272,1,272,2],[272,3,272,4],[272,5,272,6],[272,7,272,8],[272,9,272,10],[272,11,272,12],[272,13,272,14],[280,11,280,12],[280,13,280,14],[264,5,264,6],[236,11,236,12],[236,13,236,14],[244,1,244,2],[244,3,244,4],[244,5,244,6],[244,7,244,8],[244,9,244,10],[244,11,244,12],[244,13,244,14],[236,1,236,2],[236,3,236,4],[236,5,236,6],[236,7,236,8],[236,9,236,10],[264,7,264,8],[264,9,264,10],[264,11,264,12],[264,13,264,14],[220,11,220,12],[220,13,220,14],[228,1,228,2],[228,3,228,4],[228,5,228,6],[228,7,228,8],[228,9,228,10],[228,11,228,12],[228,13,228,14],[220,1,220,2],[220,3,220,4],[220,5,220,6],[220,7,220,8],[220,9,220,10],[192,11,192,12],[192,13,192,14],[209,1,209,2],[210,1,210,3],[212,1,212,2],[212,3,212,4],[212,5,212,6],[212,7,212,8],[212,9,212,10],[212,11,212,12],[212,13,212,14],[192,1,192,2],[192,3,192,4],[192,5,192,6],[192,7,192,8],[192,9,192,10],[168,3,168,4],[168,5,168,6],[168,7,168,8],[168,9,168,10],[168,11,168,12],[168,13,168,14],[176,11,176,12],[176,13,176,14],[184,1,184,2],[184,3,184,4],[184,5,184,6],[184,7,184,8],[184,9,184,10],[184,11,184,12],[184,13,184,14],[176,1,176,2],[176,3,176,4],[176,5,176,6],[176,7,176,8],[176,9,176,10],[132,11,132,12],[132,13,132,14],[140,1,140,2],[140,3,140,4],[140,5,140,6],[140,7,140,8],[140,9,140,10],[140,11,140,12],[140,13,140,14],[132,1,132,2],[132,3,132,4],[132,5,132,6],[132,7,132,8],[132,9,132,10],[116,11,116,12],[116,13,116,14],[124,1,124,2],[124,3,124,4],[124,5,124,6],[124,7,124,8],[124,9,124,10],[124,11,124,12],[124,13,124,14],[116,1,116,2],[116,3,116,4],[116,5,116,6],[116,7,116,8],[116,9,116,10],[105,1,105,2],[106,1,106,3],[108,1,108,2],[108,3,108,4],[108,5,108,6],[108,7,108,8],[108,9,108,10],[108,11,108,12],[108,13,108,14],[80,13,80,14],[72,1,72,2],[72,3,72,4],[72,5,72,6],[72,7,72,8],[72,9,72,10],[56,7,56,8],[56,9,56,10],[56,11,56,12],[56,13,56,14],[64,1,64,2],[64,3,64,4],[64,5,64,6],[64,7,64,8],[64,9,64,10],[64,11,64,12],[64,13,64,14],[53,1,53,2],[54,1,54,3],[56,1,56,2],[56,3,56,4],[56,5,56,6],[4,11,4,12],[4,13,4,14],[4,1,4,2],[4,3,4,4],[4,5,4,6],[4,7,4,8],[28,9,28,10],[28,11,28,12],[28,13,28,14],[36,1,36,2],[36,3,36,4],[36,5,36,6],[36,7,36,8],[36,9,36,10],[36,11,36,12],[36,13,36,14],[28,1,28,2],[28,3,28,4],[28,5,28,6],[28,7,28,8],[1,1,1,2],[12,1,12,2],[12,3,12,4],[2,1,2,3],[4,9,4,10],[12,9,12,10],[12,11,12,12],[12,13,12,14],[20,1,20,2],[20,3,20,4],[20,5,20,6],[20,7,20,8],[20,9,20,10],[20,11,20,12],[20,13,20,14],[12,5,12,6],[12,7,12,8],[148,3,148,4],[148,5,148,6],[148,7,148,8],[148,9,148,10],[148,11,148,12],[148,13,148,14],[200,1,200,2],[200,3,200,4],[200,5,200,6],[200,7,200,8],[200,9,200,10],[200,11,200,12],[200,13,200,14],[157,1,157,2],[158,1,158,3],[160,1,160,2],[160,3,160,4],[160,5,160,6],[160,7,160,8],[160,9,160,10],[160,11,160,12],[160,13,160,14],[148,1,148,2],[168,1,168,2],[616,1,616,2],[616,3,616,4],[616,5,616,6],[616,7,616,8],[616,9,616,10],[616,11,616,12],[616,13,616,14],[460,1,460,2],[460,3,460,4],[460,5,460,6],[460,7,460,8],[460,9,460,10],[460,11,460,12],[460,13,460,14],[469,1,469,2],[470,1,470,3],[472,1,472,2],[472,3,472,4],[472,5,472,6],[472,7,472,8],[472,9,472,10],[472,11,472,12],[472,13,472,14],[480,1,480,2],[356,3,356,4],[356,5,356,6],[356,7,356,8],[356,9,356,10],[356,11,356,12],[356,13,356,14],[252,1,252,2],[252,3,252,4],[252,5,252,6],[252,7,252,8],[252,9,252,10],[252,11,252,12],[252,13,252,14],[304,1,304,2],[304,3,304,4],[304,5,304,6],[304,7,304,8],[304,9,304,10],[304,11,304,12],[304,13,304,14],[261,1,261,2],[262,1,262,3],[264,1,264,2],[264,3,264,4]]}
[]
[null,{"$f":"設定!$C$6","v":1}]
[null,{"$f":"CHOOSE($B2,\"January\",\"February\",\"March\",\"April\",\"May\",\"June\",\"July\",\"August\",\"September\",\"October\",\"November\",\"December\")","v":"January"},null,null,{"$f":"設定!$C$5","v":2021}]
[]
[null,{"$f":"設定!$C$7","v":"月"},null,{"$f":"IF($B$5=\"日\",\"月\",\"火\")","v":"火"},null,{"$f":"IF($B$5=\"日\",\"火\",\"水\")","v":"水"},null,{"$f":"IF($B$5=\"日\",\"水\",\"木\")","v":"木"},null,{"$f":"IF($B$5=\"日\",\"木\",\"金\")","v":"金"},null,{"$f":"IF($B$5=\"日\",\"金\",\"土\")","v":"土"},null,{"$f":"IF($B$5=\"日\",\"土\",\"日\")","v":"日"}]
[null,{"$f":"IF(IF(B5=\"日\",1,2)>=WEEKDAY(DATE($E3,$B2,1)),IF(IF(B5=\"日\",1,2)-WEEKDAY(DATE($E3,$B2,1))+1>1,\"\",IF(B5=\"日\",1,2)-WEEKDAY(DATE($E3,$B2,1))+1),\"\")","v":""},{"$f":"IF(ISERROR(VLOOKUP(DATE($E$3,$B$2,B6),Holiday,2,FALSE)),\"\",VLOOKUP(DATE($E$3,$B$2,B6),Holiday,2,FALSE))","v":""},{"$f":"IF(IF(D5=\"月\",2,3)>=WEEKDAY(DATE($E3,$B2,1)),IF(IF(D5=\"月\",2,3)-WEEKDAY(DATE($E3,$B2,1))+1>2,\"\",IF(D5=\"月\",2,3)-WEEKDAY(DATE($E3,$B2,1))+1),\"\")","v":""},{"$f":"IF(ISERROR(VLOOKUP(DATE($E$3,$B$2,D6),Holiday,2,FALSE)),\"\",VLOOKUP(DATE($E$3,$B$2,D6),Holiday,2,FALSE))","v":""},{"$f":"IF(IF(F5=\"火\",3,4)>=WEEKDAY(DATE($E3,$B2,1)),IF(IF(F5=\"火\",3,4)-WEEKDAY(DATE($E3,$B2,1))+1>3,\"\",IF(F5=\"火\",3,4)-WEEKDAY(DATE($E3,$B2,1))+1),\"\")","v":""},{"$f":"IF(ISERROR(VLOOKUP(DATE($E$3,$B$2,F6),Holiday,2,FALSE)),\"\",VLOOKUP(DATE($E$3,$B$2,F6),Holiday,2,FALSE))","v":""},{"$f":"IF(IF(H5=\"水\",4,5)>=WEEKDAY(DATE($E3,$B2,1)),IF(IF(H5=\"水\",4,5)-WEEKDAY(DATE($E3,$B2,1))+1>4,\"\",IF(H5=\"水\",4,5)-WEEKDAY(DATE($E3,$B2,1))+1),\"\")","v":""},{"$f":"IF(ISERROR(VLOOKUP(DATE($E$3,$B$2,H6),Holiday,2,FALSE)),\"\",VLOOKUP(DATE($E$3,$B$2,H6),Holiday,2,FALSE))","v":""},{"$f":"IF(IF(J5=\"木\",5,6)>=WEEKDAY(DATE($E3,$B2,1)),IF(IF(J5=\"木\",5,6)-WEEKDAY(DATE($E3,$B2,1))+1>5,\"\",IF(J5=\"木\",5,6)-WEEKDAY(DATE($E3,$B2,1))+1),\"\")","v":1},{"$f":"IF(ISERROR(VLOOKUP(DATE($E$3,$B$2,J6),Holiday,2,FALSE)),\"\",VLOOKUP(DATE($E$3,$B$2,J6),Holiday,2,FALSE))","v":"元日"},{"$f":"IF(IF(L5=\"金\",6,7)>=WEEKDAY(DATE($E3,$B2,1)),IF(IF(L5=\"金\",6,7)-WEEKDAY(DATE($E3,$B2,1))+1>6,\"\",IF(L5=\"金\",6,7)-WEEKDAY(DATE($E3,$B2,1))+1),\"\")","v":2},{"$f":"IF(ISERROR(VLOOKUP(DATE($E$3,$B$2,L6),Holiday,2,FALSE)),\"\",VLOOKUP(DATE($E$3,$B$2,L6),Holiday,2,FALSE))","v":""},{"$f":"IF(L6=\"\",IF(IF(N5=\"土\",7,1)>=WEEKDAY(DATE($E$3,$B$2,1)),IF(N5=\"土\",7,1)-WEEKDAY(DATE($E$3,$B$2,1))+1),L6+1)","v":3},{"$f":"IF(ISERROR(VLOOKUP(DATE($E$3,$B$2,N6),Holiday,2,FALSE)),\"\",VLOOKUP(DATE($E$3,$B$2,N6),Holiday,2,FALSE))","v":""}]
[]
[null,{"$f":"IF(設定!$C$10=\"\",\"\",設定!$C$10)","v":"パパ"},null,{"$f":"IF(設定!$C$10=\"\",\"\",設定!$C$10)","v":"パパ"},null,{"$f":"IF(設定!$C$10=\"\",\"\",設定!$C$10)","v":"パパ"},null,{"$f":"IF(設定!$C$10=\"\",\"\",設定!$C$10)","v":"パパ"},null,{"$f":"IF(設定!$C$10=\"\",\"\",設定!$C$10)","v":"パパ"},null,{"$f":"IF(設定!$C$10=\"\",\"\",設定!$C$10)","v":"パパ"},null,{"$f":"IF(設定!$C$10=\"\",\"\",設定!$C$10)","v":"パパ"}]
[null,{"$f":"IF(設定!$C$11=\"\",\"\",設定!$C$11)","v":"ママ"},null,{"$f":"IF(設定!$C$11=\"\",\"\",設定!$C$11)","v":"ママ"},null,{"$f":"IF(設定!$C$11=\"\",\"\",設定!$C$11)","v":"ママ"},null,{"$f":"IF(設定!$C$11=\"\",\"\",設定!$C$11)","v":"ママ"},null,{"$f":"IF(設定!$C$11=\"\",\"\",設定!$C$11)","v":"ママ"},null,{"$f":"IF(設定!$C$11=\"\",\"\",設定!$C$11)","v":"ママ"},null,{"$f":"IF(設定!$C$11=\"\",\"\",設定!$C$11)","v":"ママ"}]
[null,{"$f":"IF(設定!$C$12=\"\",\"\",設定!$C$12)","v":"さとる"},null,{"$f":"IF(設定!$C$12=\"\",\"\",設定!$C$12)","v":"さとる"},null,{"$f":"IF(設定!$C$12=\"\",\"\",設定!$C$12)","v":"さとる"},null,{"$f":"IF(設定!$C$12=\"\",\"\",設定!$C$12)","v":"さとる"},null,{"$f":"IF(設定!$C$12=\"\",\"\",設定!$C$12)","v":"さとる"},null,{"$f":"IF(設定!$C$12=\"\",\"\",設定!$C$12)","v":"さとる"},null,{"$f":"IF(設定!$C$12=\"\",\"\",設定!$C$12)","v":"さとる"}]
[null,{"$f":"IF(設定!$C$13=\"\",\"\",設定!$C$13)","v":"くるみ"},null,{"$f":"IF(設定!$C$13=\"\",\"\",設定!$C$13)","v":"くるみ"},null,{"$f":"IF(設定!$C$13=\"\",\"\",設定!$C$13)","v":"くるみ"},null,{"$f":"IF(設定!$C$13=\"\",\"\",設定!$C$13)","v":"くるみ"},null,{"$f":"IF(設定!$C$13=\"\",\"\",設定!$C$13)","v":"くるみ"},null,{"$f":"IF(設定!$C$13=\"\",\"\",設定!$C$13)","v":"くるみ"},null,{"$f":"IF(設定!$C$13=\"\",\"\",設定!$C$13)","v":"くるみ"}]
[null,{"$f":"IF(設定!$C$14=\"\",\"\",設定!$C$14)","v":"ともか"},null,{"$f":"IF(設定!$C$14=\"\",\"\",設定!$C$14)","v":"ともか"},null,{"$f":"IF(設定!$C$14=\"\",\"\",設定!$C$14)","v":"ともか"},null,{"$f":"IF(設定!$C$14=\"\",\"\",設定!$C$14)","v":"ともか"},null,{"$f":"IF(設定!$C$14=\"\",\"\",設定!$C$14)","v":"ともか"},null,{"$f":"IF(設定!$C$14=\"\",\"\",設定!$C$14)","v":"ともか"},null,{"$f":"IF(設定!$C$14=\"\",\"\",設定!$C$14)","v":"ともか"}]
[null,{"$f":"$B$5","v":"月"},null,{"$f":"$D$5","v":"火"},null,{"$f":"$F$5","v":"水"},null,{"$f":"$H$5","v":"木"},null,{"$f":"$J$5","v":"金"},null,{"$f":"$L$5","v":"土"},null,{"$f":"$N$5","v":"日"}]
[null,{"$f":"$N6+1","v":4},{"$f":"IF(ISERROR(VLOOKUP(DATE($E$3,$B$2,B14),Holiday,2,FALSE)),\"\",VLOOKUP(DATE($E$3,$B$2,B14),Holiday,2,FALSE))","v":""},{"$f":"B14+1","v":5},{"$f":"IF(ISERROR(VLOOKUP(DATE($E$3,$B$2,D14),Holiday,2,FALSE)),\"\",VLOOKUP(DATE($E$3,$B$2,D14),Holiday,2,FALSE))","v":""},{"$f":"D14+1","v":6},{"$f":"IF(ISERROR(VLOOKUP(DATE($E$3,$B$2,F14),Holiday,2,FALSE)),\"\",VLOOKUP(DATE($E$3,$B$2,F14),Holiday,2,FALSE))","v":""},{"$f":"F14+1","v":7},{"$f":"IF(ISERROR(VLOOKUP(DATE($E$3,$B$2,H14),Holiday,2,FALSE)),\"\",VLOOKUP(DATE($E$3,$B$2,H14),Holiday,2,FALSE))","v":""},{"$f":"H14+1","v":8},{"$f":"IF(ISERROR(VLOOKUP(DATE($E$3,$B$2,J14),Holiday,2,FALSE)),\"\",VLOOKUP(DATE($E$3,$B$2,J14),Holiday,2,FALSE))","v":""},{"$f":"J14+1","v":9},{"$f":"IF(ISERROR(VLOOKUP(DATE($E$3,$B$2,L14),Holiday,2,FALSE)),\"\",VLOOKUP(DATE($E$3,$B$2,L14),Holiday,2,FALSE))","v":""},{"$f":"L14+1","v":10},{"$f":"IF(ISERROR(VLOOKUP(DATE($E$3,$B$2,N14),Holiday,2,FALSE)),\"\",VLOOKUP(DATE($E$3,$B$2,N14),Holiday,2,FALSE))","v":""}]
[]
[null,{"$f":"IF(設定!$C$10=\"\",\"\",設定!$C$10)","v":"パパ"},null,{"$f":"IF(設定!$C$10=\"\",\"\",設定!$C$10)","v":"パパ"},null,{"$f":"IF(設定!$C$10=\"\",\"\",設定!$C$10)","v":"パパ"},null,{"$f":"IF(設定!$C$10=\"\",\"\",設定!$C$10)","v":"パパ"},null,{"$f":"IF(設定!$C$10=\"\",\"\",設定!$C$10)","v":"パパ"},null,{"$f":"IF(設定!$C$10=\"\",\"\",設定!$C$10)","v":"パパ"},null,{"$f":"IF(設定!$C$10=\"\",\"\",設定!$C$10)","v":"パパ"}]
[null,{"$f":"IF(設定!$C$11=\"\",\"\",設定!$C$11)","v":"ママ"},null,{"$f":"IF(設定!$C$11=\"\",\"\",設定!$C$11)","v":"ママ"},null,{"$f":"IF(設定!$C$11=\"\",\"\",設定!$C$11)","v":"ママ"},null,{"$f":"IF(設定!$C$11=\"\",\"\",設定!$C$11)","v":"ママ"},null,{"$f":"IF(設定!$C$11=\"\",\"\",設定!$C$11)","v":"ママ"},null,{"$f":"IF(設定!$C$11=\"\",\"\",設定!$C$11)","v":"ママ"},null,{"$f":"IF(設定!$C$11=\"\",\"\",設定!$C$11)","v":"ママ"}]
[null,{"$f":"IF(設定!$C$12=\"\",\"\",設定!$C$12)","v":"さとる"},null,{"$f":"IF(設定!$C$12=\"\",\"\",設定!$C$12)","v":"さとる"},null,{"$f":"IF(設定!$C$12=\"\",\"\",設定!$C$12)","v":"さとる"},null,{"$f":"IF(設定!$C$12=\"\",\"\",設定!$C$12)","v":"さとる"},null,{"$f":"IF(設定!$C$12=\"\",\"\",設定!$C$12)","v":"さとる"},null,{"$f":"IF(設定!$C$12=\"\",\"\",設定!$C$12)","v":"さとる"},null,{"$f":"IF(設定!$C$12=\"\",\"\",設定!$C$12)","v":"さとる"}]
[null,{"$f":"IF(設定!$C$13=\"\",\"\",設定!$C$13)","v":"くるみ"},null,{"$f":"IF(設定!$C$13=\"\",\"\",設定!$C$13)","v":"くるみ"},null,{"$f":"IF(設定!$C$13=\"\",\"\",設定!$C$13)","v":"くるみ"},null,{"$f":"IF(設定!$C$13=\"\",\"\",設定!$C$13)","v":"くるみ"},null,{"$f":"IF(設定!$C$13=\"\",\"\",設定!$C$13)","v":"くるみ"},null,{"$f":"IF(設定!$C$13=\"\",\"\",設定!$C$13)","v":"くるみ"},null,{"$f":"IF(設定!$C$13=\"\",\"\",設定!$C$13)","v":"くるみ"}]
[null,{"$f":"IF(設定!$C$14=\"\",\"\",設定!$C$14)","v":"ともか"},null,{"$f":"IF(設定!$C$14=\"\",\"\",設定!$C$14)","v":"ともか"},null,{"$f":"IF(設定!$C$14=\"\",\"\",設定!$C$14)","v":"ともか"},null,{"$f":"IF(設定!$C$14=\"\",\"\",設定!$C$14)","v":"ともか"},null,{"$f":"IF(設定!$C$14=\"\",\"\",設定!$C$14)","v":"ともか"},null,{"$f":"IF(設定!$C$14=\"\",\"\",設定!$C$14)","v":"ともか"},null,{"$f":"IF(設定!$C$14=\"\",\"\",設定!$C$14)","v":"ともか"}]
[null,{"$f":"$B$5","v":"月"},null,{"$f":"$D$5","v":"火"},null,{"$f":"$F$5","v":"水"},null,{"$f":"$H$5","v":"木"},null,{"$f":"$J$5","v":"金"},null,{"$f":"$L$5","v":"土"},null,{"$f":"$N$5","v":"日"}]
[null,{"$f":"$N14+1","v":11},{"$f":"IF(ISERROR(VLOOKUP(DATE($E$3,$B$2,B22),Holiday,2,FALSE)),\"\",VLOOKUP(DATE($E$3,$B$2,B22),Holiday,2,FALSE))","v":"成人の日"},{"$f":"B22+1","v":12},{"$f":"IF(ISERROR(VLOOKUP(DATE($E$3,$B$2,D22),Holiday,2,FALSE)),\"\",VLOOKUP(DATE($E$3,$B$2,D22),Holiday,2,FALSE))","v":""},{"$f":"D22+1","v":13},{"$f":"IF(ISERROR(VLOOKUP(DATE($E$3,$B$2,F22),Holiday,2,FALSE)),\"\",VLOOKUP(DATE($E$3,$B$2,F22),Holiday,2,FALSE))","v":""},{"$f":"F22+1","v":14},{"$f":"IF(ISERROR(VLOOKUP(DATE($E$3,$B$2,H22),Holiday,2,FALSE)),\"\",VLOOKUP(DATE($E$3,$B$2,H22),Holiday,2,FALSE))","v":""},{"$f":"H22+1","v":15},{"$f":"IF(ISERROR(VLOOKUP(DATE($E$3,$B$2,J22),Holiday,2,FALSE)),\"\",VLOOKUP(DATE($E$3,$B$2,J22),Holiday,2,FALSE))","v":""},{"$f":"J22+1","v":16},{"$f":"IF(ISERROR(VLOOKUP(DATE($E$3,$B$2,L22),Holiday,2,FALSE)),\"\",VLOOKUP(DATE($E$3,$B$2,L22),Holiday,2,FALSE))","v":""},{"$f":"L22+1","v":17},{"$f":"IF(ISERROR(VLOOKUP(DATE($E$3,$B$2,N22),Holiday,2,FALSE)),\"\",VLOOKUP(DATE($E$3,$B$2,N22),Holiday,2,FALSE))","v":""}]
[]
[null,{"$f":"IF(設定!$C$10=\"\",\"\",設定!$C$10)","v":"パパ"},null,{"$f":"IF(設定!$C$10=\"\",\"\",設定!$C$10)","v":"パパ"},null,{"$f":"IF(設定!$C$10=\"\",\"\",設定!$C$10)","v":"パパ"},null,{"$f":"IF(設定!$C$10=\"\",\"\",設定!$C$10)","v":"パパ"},null,{"$f":"IF(設定!$C$10=\"\",\"\",設定!$C$10)","v":"パパ"},null,{"$f":"IF(設定!$C$10=\"\",\"\",設定!$C$10)","v":"パパ"},null,{"$f":"IF(設定!$C$10=\"\",\"\",設定!$C$10)","v":"パパ"}]
[null,{"$f":"IF(設定!$C$11=\"\",\"\",設定!$C$11)","v":"ママ"},null,{"$f":"IF(設定!$C$11=\"\",\"\",設定!$C$11)","v":"ママ"},null,{"$f":"IF(設定!$C$11=\"\",\"\",設定!$C$11)","v":"ママ"},null,{"$f":"IF(設定!$C$11=\"\",\"\",設定!$C$11)","v":"ママ"},null,{"$f":"IF(設定!$C$11=\"\",\"\",設定!$C$11)","v":"ママ"},null,{"$f":"IF(設定!$C$11=\"\",\"\",設定!$C$11)","v":"ママ"},null,{"$f":"IF(設定!$C$11=\"\",\"\",設定!$C$11)","v":"ママ"}]
[null,{"$f":"IF(設定!$C$12=\"\",\"\",設定!$C$12)","v":"さとる"},null,{"$f":"IF(設定!$C$12=\"\",\"\",設定!$C$12)","v":"さとる"},null,{"$f":"IF(設定!$C$12=\"\",\"\",設定!$C$12)","v":"さとる"},null,{"$f":"IF(設定!$C$12=\"\",\"\",設定!$C$12)","v":"さとる"},null,{"$f":"IF(設定!$C$12=\"\",\"\",設定!$C$12)","v":"さとる"},null,{"$f":"IF(設定!$C$12=\"\",\"\",設定!$C$12)","v":"さとる"},null,{"$f":"IF(設定!$C$12=\"\",\"\",設定!$C$12)","v":"さとる"}]
[null,{"$f":"IF(設定!$C$13=\"\",\"\",設定!$C$13)","v":"くるみ"},null,{"$f":"IF(設定!$C$13=\"\",\"\",設定!$C$13)","v":"くるみ"},null,{"$f":"IF(設定!$C$13=\"\",\"\",設定!$C$13)","v":"くるみ"},null,{"$f":"IF(設定!$C$13=\"\",\"\",設定!$C$13)","v":"くるみ"},null,{"$f":"IF(設定!$C$13=\"\",\"\",設定!$C$13)","v":"くるみ"},null,{"$f":"IF(設定!$C$13=\"\",\"\",設定!$C$13)","v":"くるみ"},null,{"$f":"IF(設定!$C$13=\"\",\"\",設定!$C$13)","v":"くるみ"}]
[null,{"$f":"IF(設定!$C$14=\"\",\"\",設定!$C$14)","v":"ともか"},null,{"$f":"IF(設定!$C$14=\"\",\"\",設定!$C$14)","v":"ともか"},null,{"$f":"IF(設定!$C$14=\"\",\"\",設定!$C$14)","v":"ともか"},null,{"$f":"IF(設定!$C$14=\"\",\"\",設定!$C$14)","v":"ともか"},null,{"$f":"IF(設定!$C$14=\"\",\"\",設定!$C$14)","v":"ともか"},null,{"$f":"IF(設定!$C$14=\"\",\"\",設定!$C$14)","v":"ともか"},null,{"$f":"IF(設定!$C$14=\"\",\"\",設定!$C$14)","v":"ともか"}]
[null,{"$f":"$B$5","v":"月"},null,{"$f":"$D$5","v":"火"},null,{"$f":"$F$5","v":"水"},null,{"$f":"$H$5","v":"木"},null,{"$f":"$J$5","v":"金"},null,{"$f":"$L$5","v":"土"},null,{"$f":"$N$5","v":"日"}]
[null,{"$f":"$N22+1","v":18},{"$f":"IF(ISERROR(VLOOKUP(DATE($E$3,$B$2,B30),Holiday,2,FALSE)),\"\",VLOOKUP(DATE($E$3,$B$2,B30),Holiday,2,FALSE))","v":""},{"$f":"B30+1","v":19},{"$f":"IF(ISERROR(VLOOKUP(DATE($E$3,$B$2,D30),Holiday,2,FALSE)),\"\",VLOOKUP(DATE($E$3,$B$2,D30),Holiday,2,FALSE))","v":""},{"$f":"D30+1","v":20},{"$f":"IF(ISERROR(VLOOKUP(DATE($E$3,$B$2,F30),Holiday,2,FALSE)),\"\",VLOOKUP(DATE($E$3,$B$2,F30),Holiday,2,FALSE))","v":""},{"$f":"F30+1","v":21},{"$f":"IF(ISERROR(VLOOKUP(DATE($E$3,$B$2,H30),Holiday,2,FALSE)),\"\",VLOOKUP(DATE($E$3,$B$2,H30),Holiday,2,FALSE))","v":""},{"$f":"H30+1","v":22},{"$f":"IF(ISERROR(VLOOKUP(DATE($E$3,$B$2,J30),Holiday,2,FALSE)),\"\",VLOOKUP(DATE($E$3,$B$2,J30),Holiday,2,FALSE))","v":""},{"$f":"J30+1","v":23},{"$f":"IF(ISERROR(VLOOKUP(DATE($E$3,$B$2,L30),Holiday,2,FALSE)),\"\",VLOOKUP(DATE($E$3,$B$2,L30),Holiday,2,FALSE))","v":""},{"$f":"L30+1","v":24},{"$f":"IF(ISERROR(VLOOKUP(DATE($E$3,$B$2,N30),Holiday,2,FALSE)),\"\",VLOOKUP(DATE($E$3,$B$2,N30),Holiday,2,FALSE))","v":""}]
[]
[null,{"$f":"IF(設定!$C$10=\"\",\"\",設定!$C$10)","v":"パパ"},null,{"$f":"IF(設定!$C$10=\"\",\"\",設定!$C$10)","v":"パパ"},null,{"$f":"IF(設定!$C$10=\"\",\"\",設定!$C$10)","v":"パパ"},null,{"$f":"IF(設定!$C$10=\"\",\"\",設定!$C$10)","v":"パパ"},null,{"$f":"IF(設定!$C$10=\"\",\"\",設定!$C$10)","v":"パパ"},null,{"$f":"IF(設定!$C$10=\"\",\"\",設定!$C$10)","v":"パパ"},null,{"$f":"IF(設定!$C$10=\"\",\"\",設定!$C$10)","v":"パパ"}]
[null,{"$f":"IF(設定!$C$11=\"\",\"\",設定!$C$11)","v":"ママ"},null,{"$f":"IF(設定!$C$11=\"\",\"\",設定!$C$11)","v":"ママ"},null,{"$f":"IF(設定!$C$11=\"\",\"\",設定!$C$11)","v":"ママ"},null,{"$f":"IF(設定!$C$11=\"\",\"\",設定!$C$11)","v":"ママ"},null,{"$f":"IF(設定!$C$11=\"\",\"\",設定!$C$11)","v":"ママ"},null,{"$f":"IF(設定!$C$11=\"\",\"\",設定!$C$11)","v":"ママ"},null,{"$f":"IF(設定!$C$11=\"\",\"\",設定!$C$11)","v":"ママ"}]
[null,{"$f":"IF(設定!$C$12=\"\",\"\",設定!$C$12)","v":"さとる"},null,{"$f":"IF(設定!$C$12=\"\",\"\",設定!$C$12)","v":"さとる"},null,{"$f":"IF(設定!$C$12=\"\",\"\",設定!$C$12)","v":"さとる"},null,{"$f":"IF(設定!$C$12=\"\",\"\",設定!$C$12)","v":"さとる"},null,{"$f":"IF(設定!$C$12=\"\",\"\",設定!$C$12)","v":"さとる"},null,{"$f":"IF(設定!$C$12=\"\",\"\",設定!$C$12)","v":"さとる"},null,{"$f":"IF(設定!$C$12=\"\",\"\",設定!$C$12)","v":"さとる"}]
[null,{"$f":"IF(設定!$C$13=\"\",\"\",設定!$C$13)","v":"くるみ"},null,{"$f":"IF(設定!$C$13=\"\",\"\",設定!$C$13)","v":"くるみ"},null,{"$f":"IF(設定!$C$13=\"\",\"\",設定!$C$13)","v":"くるみ"},null,{"$f":"IF(設定!$C$13=\"\",\"\",設定!$C$13)","v":"くるみ"},null,{"$f":"IF(設定!$C$13=\"\",\"\",設定!$C$13)","v":"くるみ"},null,{"$f":"IF(設定!$C$13=\"\",\"\",設定!$C$13)","v":"くるみ"},null,{"$f":"IF(設定!$C$13=\"\",\"\",設定!$C$13)","v":"くるみ"}]
[null,{"$f":"IF(設定!$C$14=\"\",\"\",設定!$C$14)","v":"ともか"},null,{"$f":"IF(設定!$C$14=\"\",\"\",設定!$C$14)","v":"ともか"},null,{"$f":"IF(設定!$C$14=\"\",\"\",設定!$C$14)","v":"ともか"},null,{"$f":"IF(設定!$C$14=\"\",\"\",設定!$C$14)","v":"ともか"},null,{"$f":"IF(設定!$C$14=\"\",\"\",設定!$C$14)","v":"ともか"},null,{"$f":"IF(設定!$C$14=\"\",\"\",設定!$C$14)","v":"ともか"},null,{"$f":"IF(設定!$C$14=\"\",\"\",設定!$C$14)","v":"ともか"}]
[null,{"$f":"$B$5","v":"月"},null,{"$f":"$D$5","v":"火"},null,{"$f":"$F$5","v":"水"},null,{"$f":"$H$5","v":"木"},null,{"$f":"$J$5","v":"金"},null,{"$f":"$L$5","v":"土"},null,{"$f":"$N$5","v":"日"}]
[null,{"$f":"$N30+1","v":25},{"$f":"IF(ISERROR(VLOOKUP(DATE($E$3,$B$2,B38),Holiday,2,FALSE)),\"\",VLOOKUP(DATE($E$3,$B$2,B38),Holiday,2,FALSE))","v":""},{"$f":"B38+1","v":26},{"$f":"IF(ISERROR(VLOOKUP(DATE($E$3,$B$2,D38),Holiday,2,FALSE)),\"\",VLOOKUP(DATE($E$3,$B$2,D38),Holiday,2,FALSE))","v":""},{"$f":"D38+1","v":27},{"$f":"IF(ISERROR(VLOOKUP(DATE($E$3,$B$2,F38),Holiday,2,FALSE)),\"\",VLOOKUP(DATE($E$3,$B$2,F38),Holiday,2,FALSE))","v":""},{"$f":"F38+1","v":28},{"$f":"IF(ISERROR(VLOOKUP(DATE($E$3,$B$2,H38),Holiday,2,FALSE)),\"\",VLOOKUP(DATE($E$3,$B$2,H38),Holiday,2,FALSE))","v":""},{"$f":"H38+1","v":29},{"$f":"IF(ISERROR(VLOOKUP(DATE($E$3,$B$2,J38),Holiday,2,FALSE)),\"\",VLOOKUP(DATE($E$3,$B$2,J38),Holiday,2,FALSE))","v":""},{"$f":"J38+1","v":30},{"$f":"IF(ISERROR(VLOOKUP(DATE($E$3,$B$2,L38),Holiday,2,FALSE)),\"\",VLOOKUP(DATE($E$3,$B$2,L38),Holiday,2,FALSE))","v":""},{"$f":"L38+1","v":31},{"$f":"IF(ISERROR(VLOOKUP(DATE($E$3,$B$2,N38),Holiday,2,FALSE)),\"\",VLOOKUP(DATE($E$3,$B$2,N38),Holiday,2,FALSE))","v":""}]
[]
[null,{"$f":"IF(設定!$C$10=\"\",\"\",設定!$C$10)","v":"パパ"},null,{"$f":"IF(設定!$C$10=\"\",\"\",設定!$C$10)","v":"パパ"},null,{"$f":"IF(設定!$C$10=\"\",\"\",設定!$C$10)","v":"パパ"},null,{"$f":"IF(設定!$C$10=\"\",\"\",設定!$C$10)","v":"パパ"},null,{"$f":"IF(設定!$C$10=\"\",\"\",設定!$C$10)","v":"パパ"},null,{"$f":"IF(設定!$C$10=\"\",\"\",設定!$C$10)","v":"パパ"},null,{"$f":"IF(設定!$C$10=\"\",\"\",設定!$C$10)","v":"パパ"}]
[null,{"$f":"IF(設定!$C$11=\"\",\"\",設定!$C$11)","v":"ママ"},null,{"$f":"IF(設定!$C$11=\"\",\"\",設定!$C$11)","v":"ママ"},null,{"$f":"IF(設定!$C$11=\"\",\"\",設定!$C$11)","v":"ママ"},null,{"$f":"IF(設定!$C$11=\"\",\"\",設定!$C$11)","v":"ママ"},null,{"$f":"IF(設定!$C$11=\"\",\"\",設定!$C$11)","v":"ママ"},null,{"$f":"IF(設定!$C$11=\"\",\"\",設定!$C$11)","v":"ママ"},null,{"$f":"IF(設定!$C$11=\"\",\"\",設定!$C$11)","v":"ママ"}]
[null,{"$f":"IF(設定!$C$12=\"\",\"\",設定!$C$12)","v":"さとる"},null,{"$f":"IF(設定!$C$12=\"\",\"\",設定!$C$12)","v":"さとる"},null,{"$f":"IF(設定!$C$12=\"\",\"\",設定!$C$12)","v":"さとる"},null,{"$f":"IF(設定!$C$12=\"\",\"\",設定!$C$12)","v":"さとる"},null,{"$f":"IF(設定!$C$12=\"\",\"\",設定!$C$12)","v":"さとる"},null,{"$f":"IF(設定!$C$12=\"\",\"\",設定!$C$12)","v":"さとる"},null,{"$f":"IF(設定!$C$12=\"\",\"\",設定!$C$12)","v":"さとる"}]
[null,{"$f":"IF(設定!$C$13=\"\",\"\",設定!$C$13)","v":"くるみ"},null,{"$f":"IF(設定!$C$13=\"\",\"\",設定!$C$13)","v":"くるみ"},null,{"$f":"IF(設定!$C$13=\"\",\"\",設定!$C$13)","v":"くるみ"},null,{"$f":"IF(設定!$C$13=\"\",\"\",設定!$C$13)","v":"くるみ"},null,{"$f":"IF(設定!$C$13=\"\",\"\",設定!$C$13)","v":"くるみ"},null,{"$f":"IF(設定!$C$13=\"\",\"\",設定!$C$13)","v":"くるみ"},null,{"$f":"IF(設定!$C$13=\"\",\"\",設定!$C$13)","v":"くるみ"}]
[null,{"$f":"IF(設定!$C$14=\"\",\"\",設定!$C$14)","v":"ともか"},null,{"$f":"IF(設定!$C$14=\"\",\"\",設定!$C$14)","v":"ともか"},null,{"$f":"IF(設定!$C$14=\"\",\"\",設定!$C$14)","v":"ともか"},null,{"$f":"IF(設定!$C$14=\"\",\"\",設定!$C$14)","v":"ともか"},null,{"$f":"IF(設定!$C$14=\"\",\"\",設定!$C$14)","v":"ともか"},null,{"$f":"IF(設定!$C$14=\"\",\"\",設定!$C$14)","v":"ともか"},null,{"$f":"IF(設定!$C$14=\"\",\"\",設定!$C$14)","v":"ともか"}]
[null,{"$f":"$B$5","v":"月"},null,{"$f":"$D$5","v":"火"},null,{"$f":"$F$5","v":"水"},null,{"$f":"$H$5","v":"木"},null,{"$f":"$J$5","v":"金"},null,{"$f":"$L$5","v":"土"},null,{"$f":"$N$5","v":"日"}]
[null,{"$f":"$N38+1","v":32},{"$f":"IF(ISERROR(VLOOKUP(DATE($E$3,$B$2,B46),Holiday,2,FALSE)),\"\",VLOOKUP(DATE($E$3,$B$2,B46),Holiday,2,FALSE))","v":""},{"$f":"B46+1","v":33},{"$f":"IF(ISERROR(VLOOKUP(DATE($E$3,$B$2,D46),Holiday,2,FALSE)),\"\",VLOOKUP(DATE($E$3,$B$2,D46),Holiday,2,FALSE))","v":""},{"$f":"D46+1","v":34},{"$f":"IF(ISERROR(VLOOKUP(DATE($E$3,$B$2,F46),Holiday,2,FALSE)),\"\",VLOOKUP(DATE($E$3,$B$2,F46),Holiday,2,FALSE))","v":""},{"$f":"F46+1","v":35},{"$f":"IF(ISERROR(VLOOKUP(DATE($E$3,$B$2,H46),Holiday,2,FALSE)),\"\",VLOOKUP(DATE($E$3,$B$2,H46),Holiday,2,FALSE))","v":""},{"$f":"H46+1","v":36},{"$f":"IF(ISERROR(VLOOKUP(DATE($E$3,$B$2,J46),Holiday,2,FALSE)),\"\",VLOOKUP(DATE($E$3,$B$2,J46),Holiday,2,FALSE))","v":""},{"$f":"J46+1","v":37},{"$f":"IF(ISERROR(VLOOKUP(DATE($E$3,$B$2,L46),Holiday,2,FALSE)),\"\",VLOOKUP(DATE($E$3,$B$2,L46),Holiday,2,FALSE))","v":""},{"$f":"L46+1","v":38},{"$f":"IF(ISERROR(VLOOKUP(DATE($E$3,$B$2,N46),Holiday,2,FALSE)),\"\",VLOOKUP(DATE($E$3,$B$2,N46),Holiday,2,FALSE))","v":""}]
[]
[null,{"$f":"IF(設定!$C$10=\"\",\"\",設定!$C$10)","v":"パパ"},null,{"$f":"IF(設定!$C$10=\"\",\"\",設定!$C$10)","v":"パパ"},null,{"$f":"IF(設定!$C$10=\"\",\"\",設定!$C$10)","v":"パパ"},null,{"$f":"IF(設定!$C$10=\"\",\"\",設定!$C$10)","v":"パパ"},null,{"$f":"IF(設定!$C$10=\"\",\"\",設定!$C$10)","v":"パパ"},null,{"$f":"IF(設定!$C$10=\"\",\"\",設定!$C$10)","v":"パパ"},null,{"$f":"IF(設定!$C$10=\"\",\"\",設定!$C$10)","v":"パパ"}]
[null,{"$f":"IF(設定!$C$11=\"\",\"\",設定!$C$11)","v":"ママ"},null,{"$f":"IF(設定!$C$11=\"\",\"\",設定!$C$11)","v":"ママ"},null,{"$f":"IF(設定!$C$11=\"\",\"\",設定!$C$11)","v":"ママ"},null,{"$f":"IF(設定!$C$11=\"\",\"\",設定!$C$11)","v":"ママ"},null,{"$f":"IF(設定!$C$11=\"\",\"\",設定!$C$11)","v":"ママ"},null,{"$f":"IF(設定!$C$11=\"\",\"\",設定!$C$11)","v":"ママ"},null,{"$f":"IF(設定!$C$11=\"\",\"\",設定!$C$11)","v":"ママ"}]
[null,{"$f":"IF(設定!$C$12=\"\",\"\",設定!$C$12)","v":"さとる"},null,{"$f":"IF(設定!$C$12=\"\",\"\",設定!$C$12)","v":"さとる"},null,{"$f":"IF(設定!$C$12=\"\",\"\",設定!$C$12)","v":"さとる"},null,{"$f":"IF(設定!$C$12=\"\",\"\",設定!$C$12)","v":"さとる"},null,{"$f":"IF(設定!$C$12=\"\",\"\",設定!$C$12)","v":"さとる"},null,{"$f":"IF(設定!$C$12=\"\",\"\",設定!$C$12)","v":"さとる"},null,{"$f":"IF(設定!$C$12=\"\",\"\",設定!$C$12)","v":"さとる"}]
[null,{"$f":"IF(設定!$C$13=\"\",\"\",設定!$C$13)","v":"くるみ"},null,{"$f":"IF(設定!$C$13=\"\",\"\",設定!$C$13)","v":"くるみ"},null,{"$f":"IF(設定!$C$13=\"\",\"\",設定!$C$13)","v":"くるみ"},null,{"$f":"IF(設定!$C$13=\"\",\"\",設定!$C$13)","v":"くるみ"},null,{"$f":"IF(設定!$C$13=\"\",\"\",設定!$C$13)","v":"くるみ"},null,{"$f":"IF(設定!$C$13=\"\",\"\",設定!$C$13)","v":"くるみ"},null,{"$f":"IF(設定!$C$13=\"\",\"\",設定!$C$13)","v":"くるみ"}]
[null,{"$f":"IF(設定!$C$14=\"\",\"\",設定!$C$14)","v":"ともか"},null,{"$f":"IF(設定!$C$14=\"\",\"\",設定!$C$14)","v":"ともか"},null,{"$f":"IF(設定!$C$14=\"\",\"\",設定!$C$14)","v":"ともか"},null,{"$f":"IF(設定!$C$14=\"\",\"\",設定!$C$14)","v":"ともか"},null,{"$f":"IF(設定!$C$14=\"\",\"\",設定!$C$14)","v":"ともか"},null,{"$f":"IF(設定!$C$14=\"\",\"\",設定!$C$14)","v":"ともか"},null,{"$f":"IF(設定!$C$14=\"\",\"\",設定!$C$14)","v":"ともか"}]
[2013]
[null,{"$f":"IF(B2+1>12,1,B2+1)","v":2}]
[null,{"$f":"CHOOSE($B54,\"January\",\"February\",\"March\",\"April\",\"May\",\"June\",\"July\",\"August\",\"September\",\"October\",\"November\",\"December\")","v":"February"},null,null,{"$f":"IF(B54=1,E3+1,E3)","v":2021}]
[]
[null,{"$f":"$B$5","v":"月"},null,{"$f":"$D$5","v":"火"},null,{"$f":"$F$5","v":"水"},null,{"$f":"$H$5","v":"木"},null,{"$f":"$J$5","v":"金"},null,{"$f":"$L$5","v":"土"},null,{"$f":"$N$5","v":"日"}]
[null,{"$f":"IF(IF(B57=\"日\",1,2)>=WEEKDAY(DATE($E55,$B54,1)),IF(IF(B57=\"日\",1,2)-WEEKDAY(DATE($E55,$B54,1))+1>1,\"\",IF(B57=\"日\",1,2)-WEEKDAY(DATE($E55,$B54,1))+1),\"\")","v":1},{"$f":"IF(ISERROR(VLOOKUP(DATE($E$55,$B$54,B58),Holiday,2,FALSE)),\"\",VLOOKUP(DATE($E$55,$B$54,B58),Holiday,2,FALSE))","v":""},{"$f":"IF(IF(D57=\"月\",2,3)>=WEEKDAY(DATE($E55,$B54,1)),IF(IF(D57=\"月\",2,3)-WEEKDAY(DATE($E55,$B54,1))+1>2,\"\",IF(D57=\"月\",2,3)-WEEKDAY(DATE($E55,$B54,1))+1),\"\")","v":2},{"$f":"IF(ISERROR(VLOOKUP(DATE($E$55,$B$54,D58),Holiday,2,FALSE)),\"\",VLOOKUP(DATE($E$55,$B$54,D58),Holiday,2,FALSE))","v":""},{"$f":"IF(IF(F57=\"火\",3,4)>=WEEKDAY(DATE($E55,$B54,1)),IF(IF(F57=\"火\",3,4)-WEEKDAY(DATE($E55,$B54,1))+1>3,\"\",IF(F57=\"火\",3,4)-WEEKDAY(DATE($E55,$B54,1))+1),\"\")","v":3},{"$f":"IF(ISERROR(VLOOKUP(DATE($E$55,$B$54,F58),Holiday,2,FALSE)),\"\",VLOOKUP(DATE($E$55,$B$54,F58),Holiday,2,FALSE))","v":""},{"$f":"IF(IF(H57=\"水\",4,5)>=WEEKDAY(DATE($E55,$B54,1)),IF(IF(H57=\"水\",4,5)-WEEKDAY(DATE($E55,$B54,1))+1>4,\"\",IF(H57=\"水\",4,5)-WEEKDAY(DATE($E55,$B54,1))+1),\"\")","v":4},{"$f":"IF(ISERROR(VLOOKUP(DATE($E$55,$B$54,H58),Holiday,2,FALSE)),\"\",VLOOKUP(DATE($E$55,$B$54,H58),Holiday,2,FALSE))","v":""},{"$f":"IF(IF(J57=\"木\",5,6)>=WEEKDAY(DATE($E55,$B54,1)),IF(IF(J57=\"木\",5,6)-WEEKDAY(DATE($E55,$B54,1))+1>5,\"\",IF(J57=\"木\",5,6)-WEEKDAY(DATE($E55,$B54,1))+1),\"\")","v":5},{"$f":"IF(ISERROR(VLOOKUP(DATE($E$55,$B$54,J58),Holiday,2,FALSE)),\"\",VLOOKUP(DATE($E$55,$B$54,J58),Holiday,2,FALSE))","v":""},{"$f":"IF(IF(L57=\"金\",6,7)>=WEEKDAY(DATE($E55,$B54,1)),IF(IF(L57=\"金\",6,7)-WEEKDAY(DATE($E55,$B54,1))+1>6,\"\",IF(L57=\"金\",6,7)-WEEKDAY(DATE($E55,$B54,1))+1),\"\")","v":6},{"$f":"IF(ISERROR(VLOOKUP(DATE($E$55,$B$54,L58),Holiday,2,FALSE)),\"\",VLOOKUP(DATE($E$55,$B$54,L58),Holiday,2,FALSE))","v":""},{"$f":"IF(L58=\"\",IF(IF(N57=\"土\",7,1)>=WEEKDAY(DATE($E$55,$B$54,1)),IF(N57=\"土\",7,1)-WEEKDAY(DATE($E$55,$B$54,1))+1),L58+1)","v":7},{"$f":"IF(ISERROR(VLOOKUP(DATE($E$55,$B$54,N58),Holiday,2,FALSE)),\"\",VLOOKUP(DATE($E$55,$B$54,N58),Holiday,2,FALSE))","v":""}]
[]
[null,{"$f":"IF(設定!$C$10=\"\",\"\",設定!$C$10)","v":"パパ"},null,{"$f":"IF(設定!$C$10=\"\",\"\",設定!$C$10)","v":"パパ"},null,{"$f":"IF(設定!$C$10=\"\",\"\",設定!$C$10)","v":"パパ"},null,{"$f":"IF(設定!$C$10=\"\",\"\",設定!$C$10)","v":"パパ"},null,{"$f":"IF(設定!$C$10=\"\",\"\",設定!$C$10)","v":"パパ"},null,{"$f":"IF(設定!$C$10=\"\",\"\",設定!$C$10)","v":"パパ"},null,{"$f":"IF(設定!$C$10=\"\",\"\",設定!$C$10)","v":"パパ"}]
[null,{"$f":"IF(設定!$C$11=\"\",\"\",設定!$C$11)","v":"ママ"},null,{"$f":"IF(設定!$C$11=\"\",\"\",設定!$C$11)","v":"ママ"},null,{"$f":"IF(設定!$C$11=\"\",\"\",設定!$C$11)","v":"ママ"},null,{"$f":"IF(設定!$C$11=\"\",\"\",設定!$C$11)","v":"ママ"},null,{"$f":"IF(設定!$C$11=\"\",\"\",設定!$C$11)","v":"ママ"},null,{"$f":"IF(設定!$C$11=\"\",\"\",設定!$C$11)","v":"ママ"},null,{"$f":"IF(設定!$C$11=\"\",\"\",設定!$C$11)","v":"ママ"}]
[null,{"$f":"IF(設定!$C$12=\"\",\"\",設定!$C$12)","v":"さとる"},null,{"$f":"IF(設定!$C$12=\"\",\"\",設定!$C$12)","v":"さとる"},null,{"$f":"IF(設定!$C$12=\"\",\"\",設定!$C$12)","v":"さとる"},null,{"$f":"IF(設定!$C$12=\"\",\"\",設定!$C$12)","v":"さとる"},null,{"$f":"IF(設定!$C$12=\"\",\"\",設定!$C$12)","v":"さとる"},null,{"$f":"IF(設定!$C$12=\"\",\"\",設定!$C$12)","v":"さとる"},null,{"$f":"IF(設定!$C$12=\"\",\"\",設定!$C$12)","v":"さとる"}]
[null,{"$f":"IF(設定!$C$13=\"\",\"\",設定!$C$13)","v":"くるみ"},null,{"$f":"IF(設定!$C$13=\"\",\"\",設定!$C$13)","v":"くるみ"},null,{"$f":"IF(設定!$C$13=\"\",\"\",設定!$C$13)","v":"くるみ"},null,{"$f":"IF(設定!$C$13=\"\",\"\",設定!$C$13)","v":"くるみ"},null,{"$f":"IF(設定!$C$13=\"\",\"\",設定!$C$13)","v":"くるみ"},null,{"$f":"IF(設定!$C$13=\"\",\"\",設定!$C$13)","v":"くるみ"},null,{"$f":"IF(設定!$C$13=\"\",\"\",設定!$C$13)","v":"くるみ"}]
[null,{"$f":"IF(設定!$C$14=\"\",\"\",設定!$C$14)","v":"ともか"},null,{"$f":"IF(設定!$C$14=\"\",\"\",設定!$C$14)","v":"ともか"},null,{"$f":"IF(設定!$C$14=\"\",\"\",設定!$C$14)","v":"ともか"},null,{"$f":"IF(設定!$C$14=\"\",\"\",設定!$C$14)","v":"ともか"},null,{"$f":"IF(設定!$C$14=\"\",\"\",設定!$C$14)","v":"ともか"},null,{"$f":"IF(設定!$C$14=\"\",\"\",設定!$C$14)","v":"ともか"},null,{"$f":"IF(設定!$C$14=\"\",\"\",設定!$C$14)","v":"ともか"}]
[null,{"$f":"$B$5","v":"月"},null,{"$f":"$D$5","v":"火"},null,{"$f":"$F$5","v":"水"},null,{"$f":"$H$5","v":"木"},null,{"$f":"$J$5","v":"金"},null,{"$f":"$L$5","v":"土"},null,{"$f":"$N$5","v":"日"}]
[null,{"$f":"$N58+1","v":8},{"$f":"IF(ISERROR(VLOOKUP(DATE($E$55,$B$54,B66),Holiday,2,FALSE)),\"\",VLOOKUP(DATE($E$55,$B$54,B66),Holiday,2,FALSE))","v":""},{"$f":"B66+1","v":9},{"$f":"IF(ISERROR(VLOOKUP(DATE($E$55,$B$54,D66),Holiday,2,FALSE)),\"\",VLOOKUP(DATE($E$55,$B$54,D66),Holiday,2,FALSE))","v":""},{"$f":"D66+1","v":10},{"$f":"IF(ISERROR(VLOOKUP(DATE($E$55,$B$54,F66),Holiday,2,FALSE)),\"\",VLOOKUP(DATE($E$55,$B$54,F66),Holiday,2,FALSE))","v":""},{"$f":"F66+1","v":11},{"$f":"IF(ISERROR(VLOOKUP(DATE($E$55,$B$54,H66),Holiday,2,FALSE)),\"\",VLOOKUP(DATE($E$55,$B$54,H66),Holiday,2,FALSE))","v":"建国記念の日"},{"$f":"H66+1","v":12},{"$f":"IF(ISERROR(VLOOKUP(DATE($E$55,$B$54,J66),Holiday,2,FALSE)),\"\",VLOOKUP(DATE($E$55,$B$54,J66),Holiday,2,FALSE))","v":""},{"$f":"J66+1","v":13},{"$f":"IF(ISERROR(VLOOKUP(DATE($E$55,$B$54,L66),Holiday,2,FALSE)),\"\",VLOOKUP(DATE($E$55,$B$54,L66),Holiday,2,FALSE))","v":""},{"$f":"L66+1","v":14},{"$f":"IF(ISERROR(VLOOKUP(DATE($E$55,$B$54,N66),Holiday,2,FALSE)),\"\",VLOOKUP(DATE($E$55,$B$54,N66),Holiday,2,FALSE))","v":""}]
[]
[null,{"$f":"IF(設定!$C$10=\"\",\"\",設定!$C$10)","v":"パパ"},null,{"$f":"IF(設定!$C$10=\"\",\"\",設定!$C$10)","v":"パパ"},null,{"$f":"IF(設定!$C$10=\"\",\"\",設定!$C$10)","v":"パパ"},null,{"$f":"IF(設定!$C$10=\"\",\"\",設定!$C$10)","v":"パパ"},null,{"$f":"IF(設定!$C$10=\"\",\"\",設定!$C$10)","v":"パパ"},null,{"$f":"IF(設定!$C$10=\"\",\"\",設定!$C$10)","v":"パパ"},null,{"$f":"IF(設定!$C$10=\"\",\"\",設定!$C$10)","v":"パパ"}]
[null,{"$f":"IF(設定!$C$11=\"\",\"\",設定!$C$11)","v":"ママ"},null,{"$f":"IF(設定!$C$11=\"\",\"\",設定!$C$11)","v":"ママ"},null,{"$f":"IF(設定!$C$11=\"\",\"\",設定!$C$11)","v":"ママ"},null,{"$f":"IF(設定!$C$11=\"\",\"\",設定!$C$11)","v":"ママ"},null,{"$f":"IF(設定!$C$11=\"\",\"\",設定!$C$11)","v":"ママ"},null,{"$f":"IF(設定!$C$11=\"\",\"\",設定!$C$11)","v":"ママ"},null,{"$f":"IF(設定!$C$11=\"\",\"\",設定!$C$11)","v":"ママ"}]
[null,{"$f":"IF(設定!$C$12=\"\",\"\",設定!$C$12)","v":"さとる"},null,{"$f":"IF(設定!$C$12=\"\",\"\",設定!$C$12)","v":"さとる"},null,{"$f":"IF(設定!$C$12=\"\",\"\",設定!$C$12)","v":"さとる"},null,{"$f":"IF(設定!$C$12=\"\",\"\",設定!$C$12)","v":"さとる"},null,{"$f":"IF(設定!$C$12=\"\",\"\",設定!$C$12)","v":"さとる"},null,{"$f":"IF(設定!$C$12=\"\",\"\",設定!$C$12)","v":"さとる"},null,{"$f":"IF(設定!$C$12=\"\",\"\",設定!$C$12)","v":"さとる"}]
[null,{"$f":"IF(設定!$C$13=\"\",\"\",設定!$C$13)","v":"くるみ"},null,{"$f":"IF(設定!$C$13=\"\",\"\",設定!$C$13)","v":"くるみ"},null,{"$f":"IF(設定!$C$13=\"\",\"\",設定!$C$13)","v":"くるみ"},null,{"$f":"IF(設定!$C$13=\"\",\"\",設定!$C$13)","v":"くるみ"},null,{"$f":"IF(設定!$C$13=\"\",\"\",設定!$C$13)","v":"くるみ"},null,{"$f":"IF(設定!$C$13=\"\",\"\",設定!$C$13)","v":"くるみ"},null,{"$f":"IF(設定!$C$13=\"\",\"\",設定!$C$13)","v":"くるみ"}]
[null,{"$f":"IF(設定!$C$14=\"\",\"\",設定!$C$14)","v":"ともか"},null,{"$f":"IF(設定!$C$14=\"\",\"\",設定!$C$14)","v":"ともか"},null,{"$f":"IF(設定!$C$14=\"\",\"\",設定!$C$14)","v":"ともか"},null,{"$f":"IF(設定!$C$14=\"\",\"\",設定!$C$14)","v":"ともか"},null,{"$f":"IF(設定!$C$14=\"\",\"\",設定!$C$14)","v":"ともか"},null,{"$f":"IF(設定!$C$14=\"\",\"\",設定!$C$14)","v":"ともか"},null,{"$f":"IF(設定!$C$14=\"\",\"\",設定!$C$14)","v":"ともか"}]
[null,{"$f":"$B$5","v":"月"},null,{"$f":"$D$5","v":"火"},null,{"$f":"$F$5","v":"水"},null,{"$f":"$H$5","v":"木"},null,{"$f":"$J$5","v":"金"},null,{"$f":"$L$5","v":"土"},null,{"$f":"$N$5","v":"日"}]
[null,{"$f":"$N66+1","v":15},{"$f":"IF(ISERROR(VLOOKUP(DATE($E$55,$B$54,B74),Holiday,2,FALSE)),\"\",VLOOKUP(DATE($E$55,$B$54,B74),Holiday,2,FALSE))","v":""},{"$f":"B74+1","v":16},{"$f":"IF(ISERROR(VLOOKUP(DATE($E$55,$B$54,D74),Holiday,2,FALSE)),\"\",VLOOKUP(DATE($E$55,$B$54,D74),Holiday,2,FALSE))","v":""},{"$f":"D74+1","v":17},{"$f":"IF(ISERROR(VLOOKUP(DATE($E$55,$B$54,F74),Holiday,2,FALSE)),\"\",VLOOKUP(DATE($E$55,$B$54,F74),Holiday,2,FALSE))","v":""},{"$f":"F74+1","v":18},{"$f":"IF(ISERROR(VLOOKUP(DATE($E$55,$B$54,H74),Holiday,2,FALSE)),\"\",VLOOKUP(DATE($E$55,$B$54,H74),Holiday,2,FALSE))","v":""},{"$f":"H74+1","v":19},{"$f":"IF(ISERROR(VLOOKUP(DATE($E$55,$B$54,J74),Holiday,2,FALSE)),\"\",VLOOKUP(DATE($E$55,$B$54,J74),Holiday,2,FALSE))","v":""},{"$f":"J74+1","v":20},{"$f":"IF(ISERROR(VLOOKUP(DATE($E$55,$B$54,L74),Holiday,2,FALSE)),\"\",VLOOKUP(DATE($E$55,$B$54,L74),Holiday,2,FALSE))","v":""},{"$f":"L74+1","v":21},{"$f":"IF(ISERROR(VLOOKUP(DATE($E$55,$B$54,N74),Holiday,2,FALSE)),\"\",VLOOKUP(DATE($E$55,$B$54,N74),Holiday,2,FALSE))","v":""}]
[]
[null,{"$f":"IF(設定!$C$10=\"\",\"\",設定!$C$10)","v":"パパ"},null,{"$f":"IF(設定!$C$10=\"\",\"\",設定!$C$10)","v":"パパ"},null,{"$f":"IF(設定!$C$10=\"\",\"\",設定!$C$10)","v":"パパ"},null,{"$f":"IF(設定!$C$10=\"\",\"\",設定!$C$10)","v":"パパ"},null,{"$f":"IF(設定!$C$10=\"\",\"\",設定!$C$10)","v":"パパ"},null,{"$f":"IF(設定!$C$10=\"\",\"\",設定!$C$10)","v":"パパ"},null,{"$f":"IF(設定!$C$10=\"\",\"\",設定!$C$10)","v":"パパ"}]
[null,{"$f":"IF(設定!$C$11=\"\",\"\",設定!$C$11)","v":"ママ"},null,{"$f":"IF(設定!$C$11=\"\",\"\",設定!$C$11)","v":"ママ"},null,{"$f":"IF(設定!$C$11=\"\",\"\",設定!$C$11)","v":"ママ"},null,{"$f":"IF(設定!$C$11=\"\",\"\",設定!$C$11)","v":"ママ"},null,{"$f":"IF(設定!$C$11=\"\",\"\",設定!$C$11)","v":"ママ"},null,{"$f":"IF(設定!$C$11=\"\",\"\",設定!$C$11)","v":"ママ"},null,{"$f":"IF(設定!$C$11=\"\",\"\",設定!$C$11)","v":"ママ"}]
[null,{"$f":"IF(設定!$C$12=\"\",\"\",設定!$C$12)","v":"さとる"},null,{"$f":"IF(設定!$C$12=\"\",\"\",設定!$C$12)","v":"さとる"},null,{"$f":"IF(設定!$C$12=\"\",\"\",設定!$C$12)","v":"さとる"},null,{"$f":"IF(設定!$C$12=\"\",\"\",設定!$C$12)","v":"さとる"},null,{"$f":"IF(設定!$C$12=\"\",\"\",設定!$C$12)","v":"さとる"},null,{"$f":"IF(設定!$C$12=\"\",\"\",設定!$C$12)","v":"さとる"},null,{"$f":"IF(設定!$C$12=\"\",\"\",設定!$C$12)","v":"さとる"}]
[null,{"$f":"IF(設定!$C$13=\"\",\"\",設定!$C$13)","v":"くるみ"},null,{"$f":"IF(設定!$C$13=\"\",\"\",設定!$C$13)","v":"くるみ"},null,{"$f":"IF(設定!$C$13=\"\",\"\",設定!$C$13)","v":"くるみ"},null,{"$f":"IF(設定!$C$13=\"\",\"\",設定!$C$13)","v":"くるみ"},null,{"$f":"IF(設定!$C$13=\"\",\"\",設定!$C$13)","v":"くるみ"},null,{"$f":"IF(設定!$C$13=\"\",\"\",設定!$C$13)","v":"くるみ"},null,{"$f":"IF(設定!$C$13=\"\",\"\",設定!$C$13)","v":"くるみ"}]
[null,{"$f":"IF(設定!$C$14=\"\",\"\",設定!$C$14)","v":"ともか"},null,{"$f":"IF(設定!$C$14=\"\",\"\",設定!$C$14)","v":"ともか"},null,{"$f":"IF(設定!$C$14=\"\",\"\",設定!$C$14)","v":"ともか"},null,{"$f":"IF(設定!$C$14=\"\",\"\",設定!$C$14)","v":"ともか"},null,{"$f":"IF(設定!$C$14=\"\",\"\",設定!$C$14)","v":"ともか"},null,{"$f":"IF(設定!$C$14=\"\",\"\",設定!$C$14)","v":"ともか"},null,{"$f":"IF(設定!$C$14=\"\",\"\",設定!$C$14)","v":"ともか"}]
[null,{"$f":"$B$5","v":"月"},null,{"$f":"$D$5","v":"火"},null,{"$f":"$F$5","v":"水"},null,{"$f":"$H$5","v":"木"},null,{"$f":"$J$5","v":"金"},null,{"$f":"$L$5","v":"土"},null,{"$f":"$N$5","v":"日"}]
[null,{"$f":"$N74+1","v":22},{"$f":"IF(ISERROR(VLOOKUP(DATE($E$55,$B$54,B82),Holiday,2,FALSE)),\"\",VLOOKUP(DATE($E$55,$B$54,B82),Holiday,2,FALSE))","v":""},{"$f":"B82+1","v":23},{"$f":"IF(ISERROR(VLOOKUP(DATE($E$55,$B$54,D82),Holiday,2,FALSE)),\"\",VLOOKUP(DATE($E$55,$B$54,D82),Holiday,2,FALSE))","v":""},{"$f":"D82+1","v":24},{"$f":"IF(ISERROR(VLOOKUP(DATE($E$55,$B$54,F82),Holiday,2,FALSE)),\"\",VLOOKUP(DATE($E$55,$B$54,F82),Holiday,2,FALSE))","v":""},{"$f":"F82+1","v":25},{"$f":"IF(ISERROR(VLOOKUP(DATE($E$55,$B$54,H82),Holiday,2,FALSE)),\"\",VLOOKUP(DATE($E$55,$B$54,H82),Holiday,2,FALSE))","v":""},{"$f":"H82+1","v":26},{"$f":"IF(ISERROR(VLOOKUP(DATE($E$55,$B$54,J82),Holiday,2,FALSE)),\"\",VLOOKUP(DATE($E$55,$B$54,J82),Holiday,2,FALSE))","v":""},{"$f":"J82+1","v":27},{"$f":"IF(ISERROR(VLOOKUP(DATE($E$55,$B$54,L82),Holiday,2,FALSE)),\"\",VLOOKUP(DATE($E$55,$B$54,L82),Holiday,2,FALSE))","v":""},{"$f":"L82+1","v":28},{"$f":"IF(ISERROR(VLOOKUP(DATE($E$55,$B$54,N82),Holiday,2,FALSE)),\"\",VLOOKUP(DATE($E$55,$B$54,N82),Holiday,2,FALSE))","v":""}]
[]
[null,{"$f":"IF(設定!$C$10=\"\",\"\",設定!$C$10)","v":"パパ"},null,{"$f":"IF(設定!$C$10=\"\",\"\",設定!$C$10)","v":"パパ"},null,{"$f":"IF(設定!$C$10=\"\",\"\",設定!$C$10)","v":"パパ"},null,{"$f":"IF(設定!$C$10=\"\",\"\",設定!$C$10)","v":"パパ"},null,{"$f":"IF(設定!$C$10=\"\",\"\",設定!$C$10)","v":"パパ"},null,{"$f":"IF(設定!$C$10=\"\",\"\",設定!$C$10)","v":"パパ"},null,{"$f":"IF(設定!$C$10=\"\",\"\",設定!$C$10)","v":"パパ"}]
[null,{"$f":"IF(設定!$C$11=\"\",\"\",設定!$C$11)","v":"ママ"},null,{"$f":"IF(設定!$C$11=\"\",\"\",設定!$C$11)","v":"ママ"},null,{"$f":"IF(設定!$C$11=\"\",\"\",設定!$C$11)","v":"ママ"},null,{"$f":"IF(設定!$C$11=\"\",\"\",設定!$C$11)","v":"ママ"},null,{"$f":"IF(設定!$C$11=\"\",\"\",設定!$C$11)","v":"ママ"},null,{"$f":"IF(設定!$C$11=\"\",\"\",設定!$C$11)","v":"ママ"},null,{"$f":"IF(設定!$C$11=\"\",\"\",設定!$C$11)","v":"ママ"}]
[null,{"$f":"IF(設定!$C$12=\"\",\"\",設定!$C$12)","v":"さとる"},null,{"$f":"IF(設定!$C$12=\"\",\"\",設定!$C$12)","v":"さとる"},null,{"$f":"IF(設定!$C$12=\"\",\"\",設定!$C$12)","v":"さとる"},null,{"$f":"IF(設定!$C$12=\"\",\"\",設定!$C$12)","v":"さとる"},null,{"$f":"IF(設定!$C$12=\"\",\"\",設定!$C$12)","v":"さとる"},null,{"$f":"IF(設定!$C$12=\"\",\"\",設定!$C$12)","v":"さとる"},null,{"$f":"IF(設定!$C$12=\"\",\"\",設定!$C$12)","v":"さとる"}]
[null,{"$f":"IF(設定!$C$13=\"\",\"\",設定!$C$13)","v":"くるみ"},null,{"$f":"IF(設定!$C$13=\"\",\"\",設定!$C$13)","v":"くるみ"},null,{"$f":"IF(設定!$C$13=\"\",\"\",設定!$C$13)","v":"くるみ"},null,{"$f":"IF(設定!$C$13=\"\",\"\",設定!$C$13)","v":"くるみ"},null,{"$f":"IF(設定!$C$13=\"\",\"\",設定!$C$13)","v":"くるみ"},null,{"$f":"IF(設定!$C$13=\"\",\"\",設定!$C$13)","v":"くるみ"},null,{"$f":"IF(設定!$C$13=\"\",\"\",設定!$C$13)","v":"くるみ"}]
[null,{"$f":"IF(設定!$C$14=\"\",\"\",設定!$C$14)","v":"ともか"},null,{"$f":"IF(設定!$C$14=\"\",\"\",設定!$C$14)","v":"ともか"},null,{"$f":"IF(設定!$C$14=\"\",\"\",設定!$C$14)","v":"ともか"},null,{"$f":"IF(設定!$C$14=\"\",\"\",設定!$C$14)","v":"ともか"},null,{"$f":"IF(設定!$C$14=\"\",\"\",設定!$C$14)","v":"ともか"},null,{"$f":"IF(設定!$C$14=\"\",\"\",設定!$C$14)","v":"ともか"},null,{"$f":"IF(設定!$C$14=\"\",\"\",設定!$C$14)","v":"ともか"}]
[null,{"$f":"$B$5","v":"月"},null,{"$f":"$D$5","v":"火"},null,{"$f":"$F$5","v":"水"},null,{"$f":"$H$5","v":"木"},null,{"$f":"$J$5","v":"金"},null,{"$f":"$L$5","v":"土"},null,{"$f":"$N$5","v":"日"}]
[null,{"$f":"$N82+1","v":29},{"$f":"IF(ISERROR(VLOOKUP(DATE($E$55,$B$54,B90),Holiday,2,FALSE)),\"\",VLOOKUP(DATE($E$55,$B$54,B90),Holiday,2,FALSE))","v":""},{"$f":"B90+1","v":30},{"$f":"IF(ISERROR(VLOOKUP(DATE($E$55,$B$54,D90),Holiday,2,FALSE)),\"\",VLOOKUP(DATE($E$55,$B$54,D90),Holiday,2,FALSE))","v":""},{"$f":"D90+1","v":31},{"$f":"IF(ISERROR(VLOOKUP(DATE($E$55,$B$54,F90),Holiday,2,FALSE)),\"\",VLOOKUP(DATE($E$55,$B$54,F90),Holiday,2,FALSE))","v":""},{"$f":"F90+1","v":32},{"$f":"IF(ISERROR(VLOOKUP(DATE($E$55,$B$54,H90),Holiday,2,FALSE)),\"\",VLOOKUP(DATE($E$55,$B$54,H90),Holiday,2,FALSE))","v":""},{"$f":"H90+1","v":33},{"$f":"IF(ISERROR(VLOOKUP(DATE($E$55,$B$54,J90),Holiday,2,FALSE)),\"\",VLOOKUP(DATE($E$55,$B$54,J90),Holiday,2,FALSE))","v":""},{"$f":"J90+1","v":34},{"$f":"IF(ISERROR(VLOOKUP(DATE($E$55,$B$54,L90),Holiday,2,FALSE)),\"\",VLOOKUP(DATE($E$55,$B$54,L90),Holiday,2,FALSE))","v":""},{"$f":"L90+1","v":35},{"$f":"IF(ISERROR(VLOOKUP(DATE($E$55,$B$54,N90),Holiday,2,FALSE)),\"\",VLOOKUP(DATE($E$55,$B$54,N90),Holiday,2,FALSE))","v":""}]
[]
[null,{"$f":"IF(設定!$C$10=\"\",\"\",設定!$C$10)","v":"パパ"},null,{"$f":"IF(設定!$C$10=\"\",\"\",設定!$C$10)","v":"パパ"},null,{"$f":"IF(設定!$C$10=\"\",\"\",設定!$C$10)","v":"パパ"},null,{"$f":"IF(設定!$C$10=\"\",\"\",設定!$C$10)","v":"パパ"},null,{"$f":"IF(設定!$C$10=\"\",\"\",設定!$C$10)","v":"パパ"},null,{"$f":"IF(設定!$C$10=\"\",\"\",設定!$C$10)","v":"パパ"},null,{"$f":"IF(設定!$C$10=\"\",\"\",設定!$C$10)","v":"パパ"}]
[null,{"$f":"IF(設定!$C$11=\"\",\"\",設定!$C$11)","v":"ママ"},null,{"$f":"IF(設定!$C$11=\"\",\"\",設定!$C$11)","v":"ママ"},null,{"$f":"IF(設定!$C$11=\"\",\"\",設定!$C$11)","v":"ママ"},null,{"$f":"IF(設定!$C$11=\"\",\"\",設定!$C$11)","v":"ママ"},null,{"$f":"IF(設定!$C$11=\"\",\"\",設定!$C$11)","v":"ママ"},null,{"$f":"IF(設定!$C$11=\"\",\"\",設定!$C$11)","v":"ママ"},null,{"$f":"IF(設定!$C$11=\"\",\"\",設定!$C$11)","v":"ママ"}]
[null,{"$f":"IF(設定!$C$12=\"\",\"\",設定!$C$12)","v":"さとる"},null,{"$f":"IF(設定!$C$12=\"\",\"\",設定!$C$12)","v":"さとる"},null,{"$f":"IF(設定!$C$12=\"\",\"\",設定!$C$12)","v":"さとる"},null,{"$f":"IF(設定!$C$12=\"\",\"\",設定!$C$12)","v":"さとる"},null,{"$f":"IF(設定!$C$12=\"\",\"\",設定!$C$12)","v":"さとる"},null,{"$f":"IF(設定!$C$12=\"\",\"\",設定!$C$12)","v":"さとる"},null,{"$f":"IF(設定!$C$12=\"\",\"\",設定!$C$12)","v":"さとる"}]
[null,{"$f":"IF(設定!$C$13=\"\",\"\",設定!$C$13)","v":"くるみ"},null,{"$f":"IF(設定!$C$13=\"\",\"\",設定!$C$13)","v":"くるみ"},null,{"$f":"IF(設定!$C$13=\"\",\"\",設定!$C$13)","v":"くるみ"},null,{"$f":"IF(設定!$C$13=\"\",\"\",設定!$C$13)","v":"くるみ"},null,{"$f":"IF(設定!$C$13=\"\",\"\",設定!$C$13)","v":"くるみ"},null,{"$f":"IF(設定!$C$13=\"\",\"\",設定!$C$13)","v":"くるみ"},null,{"$f":"IF(設定!$C$13=\"\",\"\",設定!$C$13)","v":"くるみ"}]
[null,{"$f":"IF(設定!$C$14=\"\",\"\",設定!$C$14)","v":"ともか"},null,{"$f":"IF(設定!$C$14=\"\",\"\",設定!$C$14)","v":"ともか"},null,{"$f":"IF(設定!$C$14=\"\",\"\",設定!$C$14)","v":"ともか"},null,{"$f":"IF(設定!$C$14=\"\",\"\",設定!$C$14)","v":"ともか"},null,{"$f":"IF(設定!$C$14=\"\",\"\",設定!$C$14)","v":"ともか"},null,{"$f":"IF(設定!$C$14=\"\",\"\",設定!$C$14)","v":"ともか"},null,{"$f":"IF(設定!$C$14=\"\",\"\",設定!$C$14)","v":"ともか"}]
[null,{"$f":"$B$5","v":"月"},null,{"$f":"$D$5","v":"火"},null,{"$f":"$F$5","v":"水"},null,{"$f":"$H$5","v":"木"},null,{"$f":"$J$5","v":"金"},null,{"$f":"$L$5","v":"土"},null,{"$f":"$N$5","v":"日"}]
[null,{"$f":"$N90+1","v":36},{"$f":"IF(ISERROR(VLOOKUP(DATE($E$55,$B$54,B98),Holiday,2,FALSE)),\"\",VLOOKUP(DATE($E$55,$B$54,B98),Holiday,2,FALSE))","v":""},{"$f":"B98+1","v":37},{"$f":"IF(ISERROR(VLOOKUP(DATE($E$55,$B$54,D98),Holiday,2,FALSE)),\"\",VLOOKUP(DATE($E$55,$B$54,D98),Holiday,2,FALSE))","v":""},{"$f":"D98+1","v":38},{"$f":"IF(ISERROR(VLOOKUP(DATE($E$55,$B$54,F98),Holiday,2,FALSE)),\"\",VLOOKUP(DATE($E$55,$B$54,F98),Holiday,2,FALSE))","v":""},{"$f":"F98+1","v":39},{"$f":"IF(ISERROR(VLOOKUP(DATE($E$55,$B$54,H98),Holiday,2,FALSE)),\"\",VLOOKUP(DATE($E$55,$B$54,H98),Holiday,2,FALSE))","v":""},{"$f":"H98+1","v":40},{"$f":"IF(ISERROR(VLOOKUP(DATE($E$55,$B$54,J98),Holiday,2,FALSE)),\"\",VLOOKUP(DATE($E$55,$B$54,J98),Holiday,2,FALSE))","v":""},{"$f":"J98+1","v":41},{"$f":"IF(ISERROR(VLOOKUP(DATE($E$55,$B$54,L98),Holiday,2,FALSE)),\"\",VLOOKUP(DATE($E$55,$B$54,L98),Holiday,2,FALSE))","v":""},{"$f":"L98+1","v":42},{"$f":"IF(ISERROR(VLOOKUP(DATE($E$55,$B$54,N98),Holiday,2,FALSE)),\"\",VLOOKUP(DATE($E$55,$B$54,N98),Holiday,2,FALSE))","v":""}]
[]
[null,{"$f":"IF(設定!$C$10=\"\",\"\",設定!$C$10)","v":"パパ"},null,{"$f":"IF(設定!$C$10=\"\",\"\",設定!$C$10)","v":"パパ"},null,{"$f":"IF(設定!$C$10=\"\",\"\",設定!$C$10)","v":"パパ"},null,{"$f":"IF(設定!$C$10=\"\",\"\",設定!$C$10)","v":"パパ"},null,{"$f":"IF(設定!$C$10=\"\",\"\",設定!$C$10)","v":"パパ"},null,{"$f":"IF(設定!$C$10=\"\",\"\",設定!$C$10)","v":"パパ"},null,{"$f":"IF(設定!$C$10=\"\",\"\",設定!$C$10)","v":"パパ"}]
[null,{"$f":"IF(設定!$C$11=\"\",\"\",設定!$C$11)","v":"ママ"},null,{"$f":"IF(設定!$C$11=\"\",\"\",設定!$C$11)","v":"ママ"},null,{"$f":"IF(設定!$C$11=\"\",\"\",設定!$C$11)","v":"ママ"},null,{"$f":"IF(設定!$C$11=\"\",\"\",設定!$C$11)","v":"ママ"},null,{"$f":"IF(設定!$C$11=\"\",\"\",設定!$C$11)","v":"ママ"},null,{"$f":"IF(設定!$C$11=\"\",\"\",設定!$C$11)","v":"ママ"},null,{"$f":"IF(設定!$C$11=\"\",\"\",設定!$C$11)","v":"ママ"}]
[null,{"$f":"IF(設定!$C$12=\"\",\"\",設定!$C$12)","v":"さとる"},null,{"$f":"IF(設定!$C$12=\"\",\"\",設定!$C$12)","v":"さとる"},null,{"$f":"IF(設定!$C$12=\"\",\"\",設定!$C$12)","v":"さとる"},null,{"$f":"IF(設定!$C$12=\"\",\"\",設定!$C$12)","v":"さとる"},null,{"$f":"IF(設定!$C$12=\"\",\"\",設定!$C$12)","v":"さとる"},null,{"$f":"IF(設定!$C$12=\"\",\"\",設定!$C$12)","v":"さとる"},null,{"$f":"IF(設定!$C$12=\"\",\"\",設定!$C$12)","v":"さとる"}]
[null,{"$f":"IF(設定!$C$13=\"\",\"\",設定!$C$13)","v":"くるみ"},null,{"$f":"IF(設定!$C$13=\"\",\"\",設定!$C$13)","v":"くるみ"},null,{"$f":"IF(設定!$C$13=\"\",\"\",設定!$C$13)","v":"くるみ"},null,{"$f":"IF(設定!$C$13=\"\",\"\",設定!$C$13)","v":"くるみ"},null,{"$f":"IF(設定!$C$13=\"\",\"\",設定!$C$13)","v":"くるみ"},null,{"$f":"IF(設定!$C$13=\"\",\"\",設定!$C$13)","v":"くるみ"},null,{"$f":"IF(設定!$C$13=\"\",\"\",設定!$C$13)","v":"くるみ"}]
[null,{"$f":"IF(設定!$C$14=\"\",\"\",設定!$C$14)","v":"ともか"},null,{"$f":"IF(設定!$C$14=\"\",\"\",設定!$C$14)","v":"ともか"},null,{"$f":"IF(設定!$C$14=\"\",\"\",設定!$C$14)","v":"ともか"},null,{"$f":"IF(設定!$C$14=\"\",\"\",設定!$C$14)","v":"ともか"},null,{"$f":"IF(設定!$C$14=\"\",\"\",設定!$C$14)","v":"ともか"},null,{"$f":"IF(設定!$C$14=\"\",\"\",設定!$C$14)","v":"ともか"},null,{"$f":"IF(設定!$C$14=\"\",\"\",設定!$C$14)","v":"ともか"}]
[2013]
[null,{"$f":"IF(B54+1>12,1,B54+1)","v":3}]
[null,{"$f":"CHOOSE($B106,\"January\",\"February\",\"March\",\"April\",\"May\",\"June\",\"July\",\"August\",\"September\",\"October\",\"November\",\"December\")","v":"March"},null,null,{"$f":"IF(B106=1,E55+1,E55)","v":2021}]
[]
[null,{"$f":"$B$5","v":"月"},null,{"$f":"$D$5","v":"火"},null,{"$f":"$F$5","v":"水"},null,{"$f":"$H$5","v":"木"},null,{"$f":"$J$5","v":"金"},null,{"$f":"$L$5","v":"土"},null,{"$f":"$N$5","v":"日"}]
[null,{"$f":"IF(IF(B109=\"日\",1,2)>=WEEKDAY(DATE($E107,$B106,1)),IF(IF(B109=\"日\",1,2)-WEEKDAY(DATE($E107,$B106,1))+1>1,\"\",IF(B109=\"日\",1,2)-WEEKDAY(DATE($E107,$B106,1))+1),\"\")","v":1},{"$f":"IF(ISERROR(VLOOKUP(DATE($E$107,$B$106,B110),Holiday,2,FALSE)),\"\",VLOOKUP(DATE($E$107,$B$106,B110),Holiday,2,FALSE))","v":""},{"$f":"IF(IF(D109=\"月\",2,3)>=WEEKDAY(DATE($E107,$B106,1)),IF(IF(D109=\"月\",2,3)-WEEKDAY(DATE($E107,$B106,1))+1>2,\"\",IF(D109=\"月\",2,3)-WEEKDAY(DATE($E107,$B106,1))+1),\"\")","v":2},{"$f":"IF(ISERROR(VLOOKUP(DATE($E$107,$B$106,D110),Holiday,2,FALSE)),\"\",VLOOKUP(DATE($E$107,$B$106,D110),Holiday,2,FALSE))","v":""},{"$f":"IF(IF(F109=\"火\",3,4)>=WEEKDAY(DATE($E107,$B106,1)),IF(IF(F109=\"火\",3,4)-WEEKDAY(DATE($E107,$B106,1))+1>3,\"\",IF(F109=\"火\",3,4)-WEEKDAY(DATE($E107,$B106,1))+1),\"\")","v":3},{"$f":"IF(ISERROR(VLOOKUP(DATE($E$107,$B$106,F110),Holiday,2,FALSE)),\"\",VLOOKUP(DATE($E$107,$B$106,F110),Holiday,2,FALSE))","v":""},{"$f":"IF(IF(H109=\"水\",4,5)>=WEEKDAY(DATE($E107,$B106,1)),IF(IF(H109=\"水\",4,5)-WEEKDAY(DATE($E107,$B106,1))+1>4,\"\",IF(H109=\"水\",4,5)-WEEKDAY(DATE($E107,$B106,1))+1),\"\")","v":4},{"$f":"IF(ISERROR(VLOOKUP(DATE($E$107,$B$106,H110),Holiday,2,FALSE)),\"\",VLOOKUP(DATE($E$107,$B$106,H110),Holiday,2,FALSE))","v":""},{"$f":"IF(IF(J109=\"木\",5,6)>=WEEKDAY(DATE($E107,$B106,1)),IF(IF(J109=\"木\",5,6)-WEEKDAY(DATE($E107,$B106,1))+1>5,\"\",IF(J109=\"木\",5,6)-WEEKDAY(DATE($E107,$B106,1))+1),\"\")","v":5},{"$f":"IF(ISERROR(VLOOKUP(DATE($E$107,$B$106,J110),Holiday,2,FALSE)),\"\",VLOOKUP(DATE($E$107,$B$106,J110),Holiday,2,FALSE))","v":""},{"$f":"IF(IF(L109=\"金\",6,7)>=WEEKDAY(DATE($E107,$B106,1)),IF(IF(L109=\"金\",6,7)-WEEKDAY(DATE($E107,$B106,1))+1>6,\"\",IF(L109=\"金\",6,7)-WEEKDAY(DATE($E107,$B106,1))+1),\"\")","v":6},{"$f":"IF(ISERROR(VLOOKUP(DATE($E$107,$B$106,L110),Holiday,2,FALSE)),\"\",VLOOKUP(DATE($E$107,$B$106,L110),Holiday,2,FALSE))","v":""},{"$f":"IF(L110=\"\",IF(IF(N109=\"土\",7,1)>=WEEKDAY(DATE($E107,$B106,1)),IF(N109=\"土\",7,1)-WEEKDAY(DATE($E107,$B106,1))+1),L110+1)","v":7},{"$f":"IF(ISERROR(VLOOKUP(DATE($E$107,$B$106,N110),Holiday,2,FALSE)),\"\",VLOOKUP(DATE($E$107,$B$106,N110),Holiday,2,FALSE))","v":""}]
[]
[null,{"$f":"IF(設定!$C$10=\"\",\"\",設定!$C$10)","v":"パパ"},null,{"$f":"IF(設定!$C$10=\"\",\"\",設定!$C$10)","v":"パパ"},null,{"$f":"IF(設定!$C$10=\"\",\"\",設定!$C$10)","v":"パパ"},null,{"$f":"IF(設定!$C$10=\"\",\"\",設定!$C$10)","v":"パパ"},null,{"$f":"IF(設定!$C$10=\"\",\"\",設定!$C$10)","v":"パパ"},null,{"$f":"IF(設定!$C$10=\"\",\"\",設定!$C$10)","v":"パパ"},null,{"$f":"IF(設定!$C$10=\"\",\"\",設定!$C$10)","v":"パパ"}]
[null,{"$f":"IF(設定!$C$11=\"\",\"\",設定!$C$11)","v":"ママ"},null,{"$f":"IF(設定!$C$11=\"\",\"\",設定!$C$11)","v":"ママ"},null,{"$f":"IF(設定!$C$11=\"\",\"\",設定!$C$11)","v":"ママ"},null,{"$f":"IF(設定!$C$11=\"\",\"\",設定!$C$11)","v":"ママ"},null,{"$f":"IF(設定!$C$11=\"\",\"\",設定!$C$11)","v":"ママ"},null,{"$f":"IF(設定!$C$11=\"\",\"\",設定!$C$11)","v":"ママ"},null,{"$f":"IF(設定!$C$11=\"\",\"\",設定!$C$11)","v":"ママ"}]
[null,{"$f":"IF(設定!$C$12=\"\",\"\",設定!$C$12)","v":"さとる"},null,{"$f":"IF(設定!$C$12=\"\",\"\",設定!$C$12)","v":"さとる"},null,{"$f":"IF(設定!$C$12=\"\",\"\",設定!$C$12)","v":"さとる"},null,{"$f":"IF(設定!$C$12=\"\",\"\",設定!$C$12)","v":"さとる"},null,{"$f":"IF(設定!$C$12=\"\",\"\",設定!$C$12)","v":"さとる"},null,{"$f":"IF(設定!$C$12=\"\",\"\",設定!$C$12)","v":"さとる"},null,{"$f":"IF(設定!$C$12=\"\",\"\",設定!$C$12)","v":"さとる"}]
[null,{"$f":"IF(設定!$C$13=\"\",\"\",設定!$C$13)","v":"くるみ"},null,{"$f":"IF(設定!$C$13=\"\",\"\",設定!$C$13)","v":"くるみ"},null,{"$f":"IF(設定!$C$13=\"\",\"\",設定!$C$13)","v":"くるみ"},null,{"$f":"IF(設定!$C$13=\"\",\"\",設定!$C$13)","v":"くるみ"},null,{"$f":"IF(設定!$C$13=\"\",\"\",設定!$C$13)","v":"くるみ"},null,{"$f":"IF(設定!$C$13=\"\",\"\",設定!$C$13)","v":"くるみ"},null,{"$f":"IF(設定!$C$13=\"\",\"\",設定!$C$13)","v":"くるみ"}]
[null,{"$f":"IF(設定!$C$14=\"\",\"\",設定!$C$14)","v":"ともか"},null,{"$f":"IF(設定!$C$14=\"\",\"\",設定!$C$14)","v":"ともか"},null,{"$f":"IF(設定!$C$14=\"\",\"\",設定!$C$14)","v":"ともか"},null,{"$f":"IF(設定!$C$14=\"\",\"\",設定!$C$14)","v":"ともか"},null,{"$f":"IF(設定!$C$14=\"\",\"\",設定!$C$14)","v":"ともか"},null,{"$f":"IF(設定!$C$14=\"\",\"\",設定!$C$14)","v":"ともか"},null,{"$f":"IF(設定!$C$14=\"\",\"\",設定!$C$14)","v":"ともか"}]
[null,{"$f":"$B$5","v":"月"},null,{"$f":"$D$5","v":"火"},null,{"$f":"$F$5","v":"水"},null,{"$f":"$H$5","v":"木"},null,{"$f":"$J$5","v":"金"},null,{"$f":"$L$5","v":"土"},null,{"$f":"$N$5","v":"日"}]
[null,{"$f":"$N110+1","v":8},{"$f":"IF(ISERROR(VLOOKUP(DATE($E$107,$B$106,B118),Holiday,2,FALSE)),\"\",VLOOKUP(DATE($E$107,$B$106,B118),Holiday,2,FALSE))","v":""},{"$f":"B118+1","v":9},{"$f":"IF(ISERROR(VLOOKUP(DATE($E$107,$B$106,D118),Holiday,2,FALSE)),\"\",VLOOKUP(DATE($E$107,$B$106,D118),Holiday,2,FALSE))","v":""},{"$f":"D118+1","v":10},{"$f":"IF(ISERROR(VLOOKUP(DATE($E$107,$B$106,F118),Holiday,2,FALSE)),\"\",VLOOKUP(DATE($E$107,$B$106,F118),Holiday,2,FALSE))","v":""},{"$f":"F118+1","v":11},{"$f":"IF(ISERROR(VLOOKUP(DATE($E$107,$B$106,H118),Holiday,2,FALSE)),\"\",VLOOKUP(DATE($E$107,$B$106,H118),Holiday,2,FALSE))","v":""},{"$f":"H118+1","v":12},{"$f":"IF(ISERROR(VLOOKUP(DATE($E$107,$B$106,J118),Holiday,2,FALSE)),\"\",VLOOKUP(DATE($E$107,$B$106,J118),Holiday,2,FALSE))","v":""},{"$f":"J118+1","v":13},{"$f":"IF(ISERROR(VLOOKUP(DATE($E$107,$B$106,L118),Holiday,2,FALSE)),\"\",VLOOKUP(DATE($E$107,$B$106,L118),Holiday,2,FALSE))","v":""},{"$f":"L118+1","v":14},{"$f":"IF(ISERROR(VLOOKUP(DATE($E$107,$B$106,N118),Holiday,2,FALSE)),\"\",VLOOKUP(DATE($E$107,$B$106,N118),Holiday,2,FALSE))","v":""}]
[]
[null,{"$f":"IF(設定!$C$10=\"\",\"\",設定!$C$10)","v":"パパ"},null,{"$f":"IF(設定!$C$10=\"\",\"\",設定!$C$10)","v":"パパ"},null,{"$f":"IF(設定!$C$10=\"\",\"\",設定!$C$10)","v":"パパ"},null,{"$f":"IF(設定!$C$10=\"\",\"\",設定!$C$10)","v":"パパ"},null,{"$f":"IF(設定!$C$10=\"\",\"\",設定!$C$10)","v":"パパ"},null,{"$f":"IF(設定!$C$10=\"\",\"\",設定!$C$10)","v":"パパ"},null,{"$f":"IF(設定!$C$10=\"\",\"\",設定!$C$10)","v":"パパ"}]
[null,{"$f":"IF(設定!$C$11=\"\",\"\",設定!$C$11)","v":"ママ"},null,{"$f":"IF(設定!$C$11=\"\",\"\",設定!$C$11)","v":"ママ"},null,{"$f":"IF(設定!$C$11=\"\",\"\",設定!$C$11)","v":"ママ"},null,{"$f":"IF(設定!$C$11=\"\",\"\",設定!$C$11)","v":"ママ"},null,{"$f":"IF(設定!$C$11=\"\",\"\",設定!$C$11)","v":"ママ"},null,{"$f":"IF(設定!$C$11=\"\",\"\",設定!$C$11)","v":"ママ"},null,{"$f":"IF(設定!$C$11=\"\",\"\",設定!$C$11)","v":"ママ"}]
[null,{"$f":"IF(設定!$C$12=\"\",\"\",設定!$C$12)","v":"さとる"},null,{"$f":"IF(設定!$C$12=\"\",\"\",設定!$C$12)","v":"さとる"},null,{"$f":"IF(設定!$C$12=\"\",\"\",設定!$C$12)","v":"さとる"},null,{"$f":"IF(設定!$C$12=\"\",\"\",設定!$C$12)","v":"さとる"},null,{"$f":"IF(設定!$C$12=\"\",\"\",設定!$C$12)","v":"さとる"},null,{"$f":"IF(設定!$C$12=\"\",\"\",設定!$C$12)","v":"さとる"},null,{"$f":"IF(設定!$C$12=\"\",\"\",設定!$C$12)","v":"さとる"}]
[null,{"$f":"IF(設定!$C$13=\"\",\"\",設定!$C$13)","v":"くるみ"},null,{"$f":"IF(設定!$C$13=\"\",\"\",設定!$C$13)","v":"くるみ"},null,{"$f":"IF(設定!$C$13=\"\",\"\",設定!$C$13)","v":"くるみ"},null,{"$f":"IF(設定!$C$13=\"\",\"\",設定!$C$13)","v":"くるみ"},null,{"$f":"IF(設定!$C$13=\"\",\"\",設定!$C$13)","v":"くるみ"},null,{"$f":"IF(設定!$C$13=\"\",\"\",設定!$C$13)","v":"くるみ"},null,{"$f":"IF(設定!$C$13=\"\",\"\",設定!$C$13)","v":"くるみ"}]
[null,{"$f":"IF(設定!$C$14=\"\",\"\",設定!$C$14)","v":"ともか"},null,{"$f":"IF(設定!$C$14=\"\",\"\",設定!$C$14)","v":"ともか"},null,{"$f":"IF(設定!$C$14=\"\",\"\",設定!$C$14)","v":"ともか"},null,{"$f":"IF(設定!$C$14=\"\",\"\",設定!$C$14)","v":"ともか"},null,{"$f":"IF(設定!$C$14=\"\",\"\",設定!$C$14)","v":"ともか"},null,{"$f":"IF(設定!$C$14=\"\",\"\",設定!$C$14)","v":"ともか"},null,{"$f":"IF(設定!$C$14=\"\",\"\",設定!$C$14)","v":"ともか"}]
[null,{"$f":"$B$5","v":"月"},null,{"$f":"$D$5","v":"火"},null,{"$f":"$F$5","v":"水"},null,{"$f":"$H$5","v":"木"},null,{"$f":"$J$5","v":"金"},null,{"$f":"$L$5","v":"土"},null,{"$f":"$N$5","v":"日"}]
[null,{"$f":"$N118+1","v":15},{"$f":"IF(ISERROR(VLOOKUP(DATE($E$107,$B$106,B126),Holiday,2,FALSE)),\"\",VLOOKUP(DATE($E$107,$B$106,B126),Holiday,2,FALSE))","v":""},{"$f":"B126+1","v":16},{"$f":"IF(ISERROR(VLOOKUP(DATE($E$107,$B$106,D126),Holiday,2,FALSE)),\"\",VLOOKUP(DATE($E$107,$B$106,D126),Holiday,2,FALSE))","v":""},{"$f":"D126+1","v":17},{"$f":"IF(ISERROR(VLOOKUP(DATE($E$107,$B$106,F126),Holiday,2,FALSE)),\"\",VLOOKUP(DATE($E$107,$B$106,F126),Holiday,2,FALSE))","v":""},{"$f":"F126+1","v":18},{"$f":"IF(ISERROR(VLOOKUP(DATE($E$107,$B$106,H126),Holiday,2,FALSE)),\"\",VLOOKUP(DATE($E$107,$B$106,H126),Holiday,2,FALSE))","v":""},{"$f":"H126+1","v":19},{"$f":"IF(ISERROR(VLOOKUP(DATE($E$107,$B$106,J126),Holiday,2,FALSE)),\"\",VLOOKUP(DATE($E$107,$B$106,J126),Holiday,2,FALSE))","v":""},{"$f":"J126+1","v":20},{"$f":"IF(ISERROR(VLOOKUP(DATE($E$107,$B$106,L126),Holiday,2,FALSE)),\"\",VLOOKUP(DATE($E$107,$B$106,L126),Holiday,2,FALSE))","v":"春分の日"},{"$f":"L126+1","v":21},{"$f":"IF(ISERROR(VLOOKUP(DATE($E$107,$B$106,N126),Holiday,2,FALSE)),\"\",VLOOKUP(DATE($E$107,$B$106,N126),Holiday,2,FALSE))","v":""}]
[]
[null,{"$f":"IF(設定!$C$10=\"\",\"\",設定!$C$10)","v":"パパ"},null,{"$f":"IF(設定!$C$10=\"\",\"\",設定!$C$10)","v":"パパ"},null,{"$f":"IF(設定!$C$10=\"\",\"\",設定!$C$10)","v":"パパ"},null,{"$f":"IF(設定!$C$10=\"\",\"\",設定!$C$10)","v":"パパ"},null,{"$f":"IF(設定!$C$10=\"\",\"\",設定!$C$10)","v":"パパ"},null,{"$f":"IF(設定!$C$10=\"\",\"\",設定!$C$10)","v":"パパ"},null,{"$f":"IF(設定!$C$10=\"\",\"\",設定!$C$10)","v":"パパ"}]
[null,{"$f":"IF(設定!$C$11=\"\",\"\",設定!$C$11)","v":"ママ"},null,{"$f":"IF(設定!$C$11=\"\",\"\",設定!$C$11)","v":"ママ"},null,{"$f":"IF(設定!$C$11=\"\",\"\",設定!$C$11)","v":"ママ"},null,{"$f":"IF(設定!$C$11=\"\",\"\",設定!$C$11)","v":"ママ"},null,{"$f":"IF(設定!$C$11=\"\",\"\",設定!$C$11)","v":"ママ"},null,{"$f":"IF(設定!$C$11=\"\",\"\",設定!$C$11)","v":"ママ"},null,{"$f":"IF(設定!$C$11=\"\",\"\",設定!$C$11)","v":"ママ"}]
[null,{"$f":"IF(設定!$C$12=\"\",\"\",設定!$C$12)","v":"さとる"},null,{"$f":"IF(設定!$C$12=\"\",\"\",設定!$C$12)","v":"さとる"},null,{"$f":"IF(設定!$C$12=\"\",\"\",設定!$C$12)","v":"さとる"},null,{"$f":"IF(設定!$C$12=\"\",\"\",設定!$C$12)","v":"さとる"},null,{"$f":"IF(設定!$C$12=\"\",\"\",設定!$C$12)","v":"さとる"},null,{"$f":"IF(設定!$C$12=\"\",\"\",設定!$C$12)","v":"さとる"},null,{"$f":"IF(設定!$C$12=\"\",\"\",設定!$C$12)","v":"さとる"}]
[null,{"$f":"IF(設定!$C$13=\"\",\"\",設定!$C$13)","v":"くるみ"},null,{"$f":"IF(設定!$C$13=\"\",\"\",設定!$C$13)","v":"くるみ"},null,{"$f":"IF(設定!$C$13=\"\",\"\",設定!$C$13)","v":"くるみ"},null,{"$f":"IF(設定!$C$13=\"\",\"\",設定!$C$13)","v":"くるみ"},null,{"$f":"IF(設定!$C$13=\"\",\"\",設定!$C$13)","v":"くるみ"},null,{"$f":"IF(設定!$C$13=\"\",\"\",設定!$C$13)","v":"くるみ"},null,{"$f":"IF(設定!$C$13=\"\",\"\",設定!$C$13)","v":"くるみ"}]
[null,{"$f":"IF(設定!$C$14=\"\",\"\",設定!$C$14)","v":"ともか"},null,{"$f":"IF(設定!$C$14=\"\",\"\",設定!$C$14)","v":"ともか"},null,{"$f":"IF(設定!$C$14=\"\",\"\",設定!$C$14)","v":"ともか"},null,{"$f":"IF(設定!$C$14=\"\",\"\",設定!$C$14)","v":"ともか"},null,{"$f":"IF(設定!$C$14=\"\",\"\",設定!$C$14)","v":"ともか"},null,{"$f":"IF(設定!$C$14=\"\",\"\",設定!$C$14)","v":"ともか"},null,{"$f":"IF(設定!$C$14=\"\",\"\",設定!$C$14)","v":"ともか"}]
[null,{"$f":"$B$5","v":"月"},null,{"$f":"$D$5","v":"火"},null,{"$f":"$F$5","v":"水"},null,{"$f":"$H$5","v":"木"},null,{"$f":"$J$5","v":"金"},null,{"$f":"$L$5","v":"土"},null,{"$f":"$N$5","v":"日"}]
[null,{"$f":"$N126+1","v":22},{"$f":"IF(ISERROR(VLOOKUP(DATE($E$107,$B$106,B134),Holiday,2,FALSE)),\"\",VLOOKUP(DATE($E$107,$B$106,B134),Holiday,2,FALSE))","v":""},{"$f":"B134+1","v":23},{"$f":"IF(ISERROR(VLOOKUP(DATE($E$107,$B$106,D134),Holiday,2,FALSE)),\"\",VLOOKUP(DATE($E$107,$B$106,D134),Holiday,2,FALSE))","v":""},{"$f":"D134+1","v":24},{"$f":"IF(ISERROR(VLOOKUP(DATE($E$107,$B$106,F134),Holiday,2,FALSE)),\"\",VLOOKUP(DATE($E$107,$B$106,F134),Holiday,2,FALSE))","v":""},{"$f":"F134+1","v":25},{"$f":"IF(ISERROR(VLOOKUP(DATE($E$107,$B$106,H134),Holiday,2,FALSE)),\"\",VLOOKUP(DATE($E$107,$B$106,H134),Holiday,2,FALSE))","v":""},{"$f":"H134+1","v":26},{"$f":"IF(ISERROR(VLOOKUP(DATE($E$107,$B$106,J134),Holiday,2,FALSE)),\"\",VLOOKUP(DATE($E$107,$B$106,J134),Holiday,2,FALSE))","v":""},{"$f":"J134+1","v":27},{"$f":"IF(ISERROR(VLOOKUP(DATE($E$107,$B$106,L134),Holiday,2,FALSE)),\"\",VLOOKUP(DATE($E$107,$B$106,L134),Holiday,2,FALSE))","v":""},{"$f":"L134+1","v":28},{"$f":"IF(ISERROR(VLOOKUP(DATE($E$107,$B$106,N134),Holiday,2,FALSE)),\"\",VLOOKUP(DATE($E$107,$B$106,N134),Holiday,2,FALSE))","v":""}]
[]
[null,{"$f":"IF(設定!$C$10=\"\",\"\",設定!$C$10)","v":"パパ"},null,{"$f":"IF(設定!$C$10=\"\",\"\",設定!$C$10)","v":"パパ"},null,{"$f":"IF(設定!$C$10=\"\",\"\",設定!$C$10)","v":"パパ"},null,{"$f":"IF(設定!$C$10=\"\",\"\",設定!$C$10)","v":"パパ"},null,{"$f":"IF(設定!$C$10=\"\",\"\",設定!$C$10)","v":"パパ"},null,{"$f":"IF(設定!$C$10=\"\",\"\",設定!$C$10)","v":"パパ"},null,{"$f":"IF(設定!$C$10=\"\",\"\",設定!$C$10)","v":"パパ"}]
[null,{"$f":"IF(設定!$C$11=\"\",\"\",設定!$C$11)","v":"ママ"},null,{"$f":"IF(設定!$C$11=\"\",\"\",設定!$C$11)","v":"ママ"},null,{"$f":"IF(設定!$C$11=\"\",\"\",設定!$C$11)","v":"ママ"},null,{"$f":"IF(設定!$C$11=\"\",\"\",設定!$C$11)","v":"ママ"},null,{"$f":"IF(設定!$C$11=\"\",\"\",設定!$C$11)","v":"ママ"},null,{"$f":"IF(設定!$C$11=\"\",\"\",設定!$C$11)","v":"ママ"},null,{"$f":"IF(設定!$C$11=\"\",\"\",設定!$C$11)","v":"ママ"}]
[null,{"$f":"IF(設定!$C$12=\"\",\"\",設定!$C$12)","v":"さとる"},null,{"$f":"IF(設定!$C$12=\"\",\"\",設定!$C$12)","v":"さとる"},null,{"$f":"IF(設定!$C$12=\"\",\"\",設定!$C$12)","v":"さとる"},null,{"$f":"IF(設定!$C$12=\"\",\"\",設定!$C$12)","v":"さとる"},null,{"$f":"IF(設定!$C$12=\"\",\"\",設定!$C$12)","v":"さとる"},null,{"$f":"IF(設定!$C$12=\"\",\"\",設定!$C$12)","v":"さとる"},null,{"$f":"IF(設定!$C$12=\"\",\"\",設定!$C$12)","v":"さとる"}]
[null,{"$f":"IF(設定!$C$13=\"\",\"\",設定!$C$13)","v":"くるみ"},null,{"$f":"IF(設定!$C$13=\"\",\"\",設定!$C$13)","v":"くるみ"},null,{"$f":"IF(設定!$C$13=\"\",\"\",設定!$C$13)","v":"くるみ"},null,{"$f":"IF(設定!$C$13=\"\",\"\",設定!$C$13)","v":"くるみ"},null,{"$f":"IF(設定!$C$13=\"\",\"\",設定!$C$13)","v":"くるみ"},null,{"$f":"IF(設定!$C$13=\"\",\"\",設定!$C$13)","v":"くるみ"},null,{"$f":"IF(設定!$C$13=\"\",\"\",設定!$C$13)","v":"くるみ"}]
[null,{"$f":"IF(設定!$C$14=\"\",\"\",設定!$C$14)","v":"ともか"},null,{"$f":"IF(設定!$C$14=\"\",\"\",設定!$C$14)","v":"ともか"},null,{"$f":"IF(設定!$C$14=\"\",\"\",設定!$C$14)","v":"ともか"},null,{"$f":"IF(設定!$C$14=\"\",\"\",設定!$C$14)","v":"ともか"},null,{"$f":"IF(設定!$C$14=\"\",\"\",設定!$C$14)","v":"ともか"},null,{"$f":"IF(設定!$C$14=\"\",\"\",設定!$C$14)","v":"ともか"},null,{"$f":"IF(設定!$C$14=\"\",\"\",設定!$C$14)","v":"ともか"}]
[null,{"$f":"$B$5","v":"月"},null,{"$f":"$D$5","v":"火"},null,{"$f":"$F$5","v":"水"},null,{"$f":"$H$5","v":"木"},null,{"$f":"$J$5","v":"金"},null,{"$f":"$L$5","v":"土"},null,{"$f":"$N$5","v":"日"}]
[null,{"$f":"$N134+1","v":29},{"$f":"IF(ISERROR(VLOOKUP(DATE($E$107,$B$106,B142),Holiday,2,FALSE)),\"\",VLOOKUP(DATE($E$107,$B$106,B142),Holiday,2,FALSE))","v":""},{"$f":"B142+1","v":30},{"$f":"IF(ISERROR(VLOOKUP(DATE($E$107,$B$106,D142),Holiday,2,FALSE)),\"\",VLOOKUP(DATE($E$107,$B$106,D142),Holiday,2,FALSE))","v":""},{"$f":"D142+1","v":31},{"$f":"IF(ISERROR(VLOOKUP(DATE($E$107,$B$106,F142),Holiday,2,FALSE)),\"\",VLOOKUP(DATE($E$107,$B$106,F142),Holiday,2,FALSE))","v":""},{"$f":"F142+1","v":32},{"$f":"IF(ISERROR(VLOOKUP(DATE($E$107,$B$106,H142),Holiday,2,FALSE)),\"\",VLOOKUP(DATE($E$107,$B$106,H142),Holiday,2,FALSE))","v":""},{"$f":"H142+1","v":33},{"$f":"IF(ISERROR(VLOOKUP(DATE($E$107,$B$106,J142),Holiday,2,FALSE)),\"\",VLOOKUP(DATE($E$107,$B$106,J142),Holiday,2,FALSE))","v":""},{"$f":"J142+1","v":34},{"$f":"IF(ISERROR(VLOOKUP(DATE($E$107,$B$106,L142),Holiday,2,FALSE)),\"\",VLOOKUP(DATE($E$107,$B$106,L142),Holiday,2,FALSE))","v":""},{"$f":"L142+1","v":35},{"$f":"IF(ISERROR(VLOOKUP(DATE($E$107,$B$106,N142),Holiday,2,FALSE)),\"\",VLOOKUP(DATE($E$107,$B$106,N142),Holiday,2,FALSE))","v":""}]
[]
[null,{"$f":"IF(設定!$C$10=\"\",\"\",設定!$C$10)","v":"パパ"},null,{"$f":"IF(設定!$C$10=\"\",\"\",設定!$C$10)","v":"パパ"},null,{"$f":"IF(設定!$C$10=\"\",\"\",設定!$C$10)","v":"パパ"},null,{"$f":"IF(設定!$C$10=\"\",\"\",設定!$C$10)","v":"パパ"},null,{"$f":"IF(設定!$C$10=\"\",\"\",設定!$C$10)","v":"パパ"},null,{"$f":"IF(設定!$C$10=\"\",\"\",設定!$C$10)","v":"パパ"},null,{"$f":"IF(設定!$C$10=\"\",\"\",設定!$C$10)","v":"パパ"}]
[null,{"$f":"IF(設定!$C$11=\"\",\"\",設定!$C$11)","v":"ママ"},null,{"$f":"IF(設定!$C$11=\"\",\"\",設定!$C$11)","v":"ママ"},null,{"$f":"IF(設定!$C$11=\"\",\"\",設定!$C$11)","v":"ママ"},null,{"$f":"IF(設定!$C$11=\"\",\"\",設定!$C$11)","v":"ママ"},null,{"$f":"IF(設定!$C$11=\"\",\"\",設定!$C$11)","v":"ママ"},null,{"$f":"IF(設定!$C$11=\"\",\"\",設定!$C$11)","v":"ママ"},null,{"$f":"IF(設定!$C$11=\"\",\"\",設定!$C$11)","v":"ママ"}]
[null,{"$f":"IF(設定!$C$12=\"\",\"\",設定!$C$12)","v":"さとる"},null,{"$f":"IF(設定!$C$12=\"\",\"\",設定!$C$12)","v":"さとる"},null,{"$f":"IF(設定!$C$12=\"\",\"\",設定!$C$12)","v":"さとる"},null,{"$f":"IF(設定!$C$12=\"\",\"\",設定!$C$12)","v":"さとる"},null,{"$f":"IF(設定!$C$12=\"\",\"\",設定!$C$12)","v":"さとる"},null,{"$f":"IF(設定!$C$12=\"\",\"\",設定!$C$12)","v":"さとる"},null,{"$f":"IF(設定!$C$12=\"\",\"\",設定!$C$12)","v":"さとる"}]
[null,{"$f":"IF(設定!$C$13=\"\",\"\",設定!$C$13)","v":"くるみ"},null,{"$f":"IF(設定!$C$13=\"\",\"\",設定!$C$13)","v":"くるみ"},null,{"$f":"IF(設定!$C$13=\"\",\"\",設定!$C$13)","v":"くるみ"},null,{"$f":"IF(設定!$C$13=\"\",\"\",設定!$C$13)","v":"くるみ"},null,{"$f":"IF(設定!$C$13=\"\",\"\",設定!$C$13)","v":"くるみ"},null,{"$f":"IF(設定!$C$13=\"\",\"\",設定!$C$13)","v":"くるみ"},null,{"$f":"IF(設定!$C$13=\"\",\"\",設定!$C$13)","v":"くるみ"}]
[null,{"$f":"IF(設定!$C$14=\"\",\"\",設定!$C$14)","v":"ともか"},null,{"$f":"IF(設定!$C$14=\"\",\"\",設定!$C$14)","v":"ともか"},null,{"$f":"IF(設定!$C$14=\"\",\"\",設定!$C$14)","v":"ともか"},null,{"$f":"IF(設定!$C$14=\"\",\"\",設定!$C$14)","v":"ともか"},null,{"$f":"IF(設定!$C$14=\"\",\"\",設定!$C$14)","v":"ともか"},null,{"$f":"IF(設定!$C$14=\"\",\"\",設定!$C$14)","v":"ともか"},null,{"$f":"IF(設定!$C$14=\"\",\"\",設定!$C$14)","v":"ともか"}]
[null,{"$f":"$B$5","v":"月"},null,{"$f":"$D$5","v":"火"},null,{"$f":"$F$5","v":"水"},null,{"$f":"$H$5","v":"木"},null,{"$f":"$J$5","v":"金"},null,{"$f":"$L$5","v":"土"},null,{"$f":"$N$5","v":"日"}]
[null,{"$f":"$N142+1","v":36},{"$f":"IF(ISERROR(VLOOKUP(DATE($E$107,$B$106,B150),Holiday,2,FALSE)),\"\",VLOOKUP(DATE($E$107,$B$106,B150),Holiday,2,FALSE))","v":""},{"$f":"B150+1","v":37},{"$f":"IF(ISERROR(VLOOKUP(DATE($E$107,$B$106,D150),Holiday,2,FALSE)),\"\",VLOOKUP(DATE($E$107,$B$106,D150),Holiday,2,FALSE))","v":""},{"$f":"D150+1","v":38},{"$f":"IF(ISERROR(VLOOKUP(DATE($E$107,$B$106,F150),Holiday,2,FALSE)),\"\",VLOOKUP(DATE($E$107,$B$106,F150),Holiday,2,FALSE))","v":""},{"$f":"F150+1","v":39},{"$f":"IF(ISERROR(VLOOKUP(DATE($E$107,$B$106,H150),Holiday,2,FALSE)),\"\",VLOOKUP(DATE($E$107,$B$106,H150),Holiday,2,FALSE))","v":""},{"$f":"H150+1","v":40},{"$f":"IF(ISERROR(VLOOKUP(DATE($E$107,$B$106,J150),Holiday,2,FALSE)),\"\",VLOOKUP(DATE($E$107,$B$106,J150),Holiday,2,FALSE))","v":""},{"$f":"J150+1","v":41},{"$f":"IF(ISERROR(VLOOKUP(DATE($E$107,$B$106,L150),Holiday,2,FALSE)),\"\",VLOOKUP(DATE($E$107,$B$106,L150),Holiday,2,FALSE))","v":""},{"$f":"L150+1","v":42},{"$f":"IF(ISERROR(VLOOKUP(DATE($E$107,$B$106,N150),Holiday,2,FALSE)),\"\",VLOOKUP(DATE($E$107,$B$106,N150),Holiday,2,FALSE))","v":""}]
[]
[null,{"$f":"IF(設定!$C$10=\"\",\"\",設定!$C$10)","v":"パパ"},null,{"$f":"IF(設定!$C$10=\"\",\"\",設定!$C$10)","v":"パパ"},null,{"$f":"IF(設定!$C$10=\"\",\"\",設定!$C$10)","v":"パパ"},null,{"$f":"IF(設定!$C$10=\"\",\"\",設定!$C$10)","v":"パパ"},null,{"$f":"IF(設定!$C$10=\"\",\"\",設定!$C$10)","v":"パパ"},null,{"$f":"IF(設定!$C$10=\"\",\"\",設定!$C$10)","v":"パパ"},null,{"$f":"IF(設定!$C$10=\"\",\"\",設定!$C$10)","v":"パパ"}]
[null,{"$f":"IF(設定!$C$11=\"\",\"\",設定!$C$11)","v":"ママ"},null,{"$f":"IF(設定!$C$11=\"\",\"\",設定!$C$11)","v":"ママ"},null,{"$f":"IF(設定!$C$11=\"\",\"\",設定!$C$11)","v":"ママ"},null,{"$f":"IF(設定!$C$11=\"\",\"\",設定!$C$11)","v":"ママ"},null,{"$f":"IF(設定!$C$11=\"\",\"\",設定!$C$11)","v":"ママ"},null,{"$f":"IF(設定!$C$11=\"\",\"\",設定!$C$11)","v":"ママ"},null,{"$f":"IF(設定!$C$11=\"\",\"\",設定!$C$11)","v":"ママ"}]
[null,{"$f":"IF(設定!$C$12=\"\",\"\",設定!$C$12)","v":"さとる"},null,{"$f":"IF(設定!$C$12=\"\",\"\",設定!$C$12)","v":"さとる"},null,{"$f":"IF(設定!$C$12=\"\",\"\",設定!$C$12)","v":"さとる"},null,{"$f":"IF(設定!$C$12=\"\",\"\",設定!$C$12)","v":"さとる"},null,{"$f":"IF(設定!$C$12=\"\",\"\",設定!$C$12)","v":"さとる"},null,{"$f":"IF(設定!$C$12=\"\",\"\",設定!$C$12)","v":"さとる"},null,{"$f":"IF(設定!$C$12=\"\",\"\",設定!$C$12)","v":"さとる"}]
[null,{"$f":"IF(設定!$C$13=\"\",\"\",設定!$C$13)","v":"くるみ"},null,{"$f":"IF(設定!$C$13=\"\",\"\",設定!$C$13)","v":"くるみ"},null,{"$f":"IF(設定!$C$13=\"\",\"\",設定!$C$13)","v":"くるみ"},null,{"$f":"IF(設定!$C$13=\"\",\"\",設定!$C$13)","v":"くるみ"},null,{"$f":"IF(設定!$C$13=\"\",\"\",設定!$C$13)","v":"くるみ"},null,{"$f":"IF(設定!$C$13=\"\",\"\",設定!$C$13)","v":"くるみ"},null,{"$f":"IF(設定!$C$13=\"\",\"\",設定!$C$13)","v":"くるみ"}]
[null,{"$f":"IF(設定!$C$14=\"\",\"\",設定!$C$14)","v":"ともか"},null,{"$f":"IF(設定!$C$14=\"\",\"\",設定!$C$14)","v":"ともか"},null,{"$f":"IF(設定!$C$14=\"\",\"\",設定!$C$14)","v":"ともか"},null,{"$f":"IF(設定!$C$14=\"\",\"\",設定!$C$14)","v":"ともか"},null,{"$f":"IF(設定!$C$14=\"\",\"\",設定!$C$14)","v":"ともか"},null,{"$f":"IF(設定!$C$14=\"\",\"\",設定!$C$14)","v":"ともか"},null,{"$f":"IF(設定!$C$14=\"\",\"\",設定!$C$14)","v":"ともか"}]
[2013]
[null,{"$f":"IF(B106+1>12,1,B106+1)","v":4}]
[null,{"$f":"CHOOSE($B158,\"January\",\"February\",\"March\",\"April\",\"May\",\"June\",\"July\",\"August\",\"September\",\"October\",\"November\",\"December\")","v":"April"},null,null,{"$f":"IF(B158=1,E107+1,E107)","v":2021}]
[]
[null,{"$f":"$B$5","v":"月"},null,{"$f":"$D$5","v":"火"},null,{"$f":"$F$5","v":"水"},null,{"$f":"$H$5","v":"木"},null,{"$f":"$J$5","v":"金"},null,{"$f":"$L$5","v":"土"},null,{"$f":"$N$5","v":"日"}]
[null,{"$f":"IF(IF(B161=\"日\",1,2)>=WEEKDAY(DATE($E159,$B158,1)),IF(IF(B161=\"日\",1,2)-WEEKDAY(DATE($E159,$B158,1))+1>1,\"\",IF(B161=\"日\",1,2)-WEEKDAY(DATE($E159,$B158,1))+1),\"\")","v":""},{"$f":"IF(ISERROR(VLOOKUP(DATE($E$159,$B$158,B162),Holiday,2,FALSE)),\"\",VLOOKUP(DATE($E$159,$B$158,B162),Holiday,2,FALSE))","v":""},{"$f":"IF(IF(D161=\"月\",2,3)>=WEEKDAY(DATE($E159,$B158,1)),IF(IF(D161=\"月\",2,3)-WEEKDAY(DATE($E159,$B158,1))+1>2,\"\",IF(D161=\"月\",2,3)-WEEKDAY(DATE($E159,$B158,1))+1),\"\")","v":""},{"$f":"IF(ISERROR(VLOOKUP(DATE($E$159,$B$158,D162),Holiday,2,FALSE)),\"\",VLOOKUP(DATE($E$159,$B$158,D162),Holiday,2,FALSE))","v":""},{"$f":"IF(IF(F161=\"火\",3,4)>=WEEKDAY(DATE($E159,$B158,1)),IF(IF(F161=\"火\",3,4)-WEEKDAY(DATE($E159,$B158,1))+1>3,\"\",IF(F161=\"火\",3,4)-WEEKDAY(DATE($E159,$B158,1))+1),\"\")","v":""},{"$f":"IF(ISERROR(VLOOKUP(DATE($E$159,$B$158,F162),Holiday,2,FALSE)),\"\",VLOOKUP(DATE($E$159,$B$158,F162),Holiday,2,FALSE))","v":""},{"$f":"IF(IF(H161=\"水\",4,5)>=WEEKDAY(DATE($E159,$B158,1)),IF(IF(H161=\"水\",4,5)-WEEKDAY(DATE($E159,$B158,1))+1>4,\"\",IF(H161=\"水\",4,5)-WEEKDAY(DATE($E159,$B158,1))+1),\"\")","v":1},{"$f":"IF(ISERROR(VLOOKUP(DATE($E$159,$B$158,H162),Holiday,2,FALSE)),\"\",VLOOKUP(DATE($E$159,$B$158,H162),Holiday,2,FALSE))","v":""},{"$f":"IF(IF(J161=\"木\",5,6)>=WEEKDAY(DATE($E159,$B158,1)),IF(IF(J161=\"木\",5,6)-WEEKDAY(DATE($E159,$B158,1))+1>5,\"\",IF(J161=\"木\",5,6)-WEEKDAY(DATE($E159,$B158,1))+1),\"\")","v":2},{"$f":"IF(ISERROR(VLOOKUP(DATE($E$159,$B$158,J162),Holiday,2,FALSE)),\"\",VLOOKUP(DATE($E$159,$B$158,J162),Holiday,2,FALSE))","v":""},{"$f":"IF(IF(L161=\"金\",6,7)>=WEEKDAY(DATE($E159,$B158,1)),IF(IF(L161=\"金\",6,7)-WEEKDAY(DATE($E159,$B158,1))+1>6,\"\",IF(L161=\"金\",6,7)-WEEKDAY(DATE($E159,$B158,1))+1),\"\")","v":3},{"$f":"IF(ISERROR(VLOOKUP(DATE($E$159,$B$158,L162),Holiday,2,FALSE)),\"\",VLOOKUP(DATE($E$159,$B$158,L162),Holiday,2,FALSE))","v":""},{"$f":"IF(L162=\"\",IF(IF(N161=\"土\",7,1)>=WEEKDAY(DATE($E159,$B158,1)),IF(N161=\"土\",7,1)-WEEKDAY(DATE($E159,$B158,1))+1),L162+1)","v":4},{"$f":"IF(ISERROR(VLOOKUP(DATE($E$159,$B$158,N162),Holiday,2,FALSE)),\"\",VLOOKUP(DATE($E$159,$B$158,N162),Holiday,2,FALSE))","v":""}]
[]
[null,{"$f":"IF(設定!$C$10=\"\",\"\",設定!$C$10)","v":"パパ"},null,{"$f":"IF(設定!$C$10=\"\",\"\",設定!$C$10)","v":"パパ"},null,{"$f":"IF(設定!$C$10=\"\",\"\",設定!$C$10)","v":"パパ"},null,{"$f":"IF(設定!$C$10=\"\",\"\",設定!$C$10)","v":"パパ"},null,{"$f":"IF(設定!$C$10=\"\",\"\",設定!$C$10)","v":"パパ"},null,{"$f":"IF(設定!$C$10=\"\",\"\",設定!$C$10)","v":"パパ"},null,{"$f":"IF(設定!$C$10=\"\",\"\",設定!$C$10)","v":"パパ"}]
[null,{"$f":"IF(設定!$C$11=\"\",\"\",設定!$C$11)","v":"ママ"},null,{"$f":"IF(設定!$C$11=\"\",\"\",設定!$C$11)","v":"ママ"},null,{"$f":"IF(設定!$C$11=\"\",\"\",設定!$C$11)","v":"ママ"},null,{"$f":"IF(設定!$C$11=\"\",\"\",設定!$C$11)","v":"ママ"},null,{"$f":"IF(設定!$C$11=\"\",\"\",設定!$C$11)","v":"ママ"},null,{"$f":"IF(設定!$C$11=\"\",\"\",設定!$C$11)","v":"ママ"},null,{"$f":"IF(設定!$C$11=\"\",\"\",設定!$C$11)","v":"ママ"}]
[null,{"$f":"IF(設定!$C$12=\"\",\"\",設定!$C$12)","v":"さとる"},null,{"$f":"IF(設定!$C$12=\"\",\"\",設定!$C$12)","v":"さとる"},null,{"$f":"IF(設定!$C$12=\"\",\"\",設定!$C$12)","v":"さとる"},null,{"$f":"IF(設定!$C$12=\"\",\"\",設定!$C$12)","v":"さとる"},null,{"$f":"IF(設定!$C$12=\"\",\"\",設定!$C$12)","v":"さとる"},null,{"$f":"IF(設定!$C$12=\"\",\"\",設定!$C$12)","v":"さとる"},null,{"$f":"IF(設定!$C$12=\"\",\"\",設定!$C$12)","v":"さとる"}]
[null,{"$f":"IF(設定!$C$13=\"\",\"\",設定!$C$13)","v":"くるみ"},null,{"$f":"IF(設定!$C$13=\"\",\"\",設定!$C$13)","v":"くるみ"},null,{"$f":"IF(設定!$C$13=\"\",\"\",設定!$C$13)","v":"くるみ"},null,{"$f":"IF(設定!$C$13=\"\",\"\",設定!$C$13)","v":"くるみ"},null,{"$f":"IF(設定!$C$13=\"\",\"\",設定!$C$13)","v":"くるみ"},null,{"$f":"IF(設定!$C$13=\"\",\"\",設定!$C$13)","v":"くるみ"},null,{"$f":"IF(設定!$C$13=\"\",\"\",設定!$C$13)","v":"くるみ"}]
[null,{"$f":"IF(設定!$C$14=\"\",\"\",設定!$C$14)","v":"ともか"},null,{"$f":"IF(設定!$C$14=\"\",\"\",設定!$C$14)","v":"ともか"},null,{"$f":"IF(設定!$C$14=\"\",\"\",設定!$C$14)","v":"ともか"},null,{"$f":"IF(設定!$C$14=\"\",\"\",設定!$C$14)","v":"ともか"},null,{"$f":"IF(設定!$C$14=\"\",\"\",設定!$C$14)","v":"ともか"},null,{"$f":"IF(設定!$C$14=\"\",\"\",設定!$C$14)","v":"ともか"},null,{"$f":"IF(設定!$C$14=\"\",\"\",設定!$C$14)","v":"ともか"}]
[null,{"$f":"$B$5","v":"月"},null,{"$f":"$D$5","v":"火"},null,{"$f":"$F$5","v":"水"},null,{"$f":"$H$5","v":"木"},null,{"$f":"$J$5","v":"金"},null,{"$f":"$L$5","v":"土"},null,{"$f":"$N$5","v":"日"}]
[null,{"$f":"$N162+1","v":5},{"$f":"IF(ISERROR(VLOOKUP(DATE($E$159,$B$158,B170),Holiday,2,FALSE)),\"\",VLOOKUP(DATE($E$159,$B$158,B170),Holiday,2,FALSE))","v":""},{"$f":"B170+1","v":6},{"$f":"IF(ISERROR(VLOOKUP(DATE($E$159,$B$158,D170),Holiday,2,FALSE)),\"\",VLOOKUP(DATE($E$159,$B$158,D170),Holiday,2,FALSE))","v":""},{"$f":"D170+1","v":7},{"$f":"IF(ISERROR(VLOOKUP(DATE($E$159,$B$158,F170),Holiday,2,FALSE)),\"\",VLOOKUP(DATE($E$159,$B$158,F170),Holiday,2,FALSE))","v":""},{"$f":"F170+1","v":8},{"$f":"IF(ISERROR(VLOOKUP(DATE($E$159,$B$158,H170),Holiday,2,FALSE)),\"\",VLOOKUP(DATE($E$159,$B$158,H170),Holiday,2,FALSE))","v":""},{"$f":"H170+1","v":9},{"$f":"IF(ISERROR(VLOOKUP(DATE($E$159,$B$158,J170),Holiday,2,FALSE)),\"\",VLOOKUP(DATE($E$159,$B$158,J170),Holiday,2,FALSE))","v":""},{"$f":"J170+1","v":10},{"$f":"IF(ISERROR(VLOOKUP(DATE($E$159,$B$158,L170),Holiday,2,FALSE)),\"\",VLOOKUP(DATE($E$159,$B$158,L170),Holiday,2,FALSE))","v":""},{"$f":"L170+1","v":11},{"$f":"IF(ISERROR(VLOOKUP(DATE($E$159,$B$158,N170),Holiday,2,FALSE)),\"\",VLOOKUP(DATE($E$159,$B$158,N170),Holiday,2,FALSE))","v":""}]
[]
[null,{"$f":"IF(設定!$C$10=\"\",\"\",設定!$C$10)","v":"パパ"},null,{"$f":"IF(設定!$C$10=\"\",\"\",設定!$C$10)","v":"パパ"},null,{"$f":"IF(設定!$C$10=\"\",\"\",設定!$C$10)","v":"パパ"},null,{"$f":"IF(設定!$C$10=\"\",\"\",設定!$C$10)","v":"パパ"},null,{"$f":"IF(設定!$C$10=\"\",\"\",設定!$C$10)","v":"パパ"},null,{"$f":"IF(設定!$C$10=\"\",\"\",設定!$C$10)","v":"パパ"},null,{"$f":"IF(設定!$C$10=\"\",\"\",設定!$C$10)","v":"パパ"}]
[null,{"$f":"IF(設定!$C$11=\"\",\"\",設定!$C$11)","v":"ママ"},null,{"$f":"IF(設定!$C$11=\"\",\"\",設定!$C$11)","v":"ママ"},null,{"$f":"IF(設定!$C$11=\"\",\"\",設定!$C$11)","v":"ママ"},null,{"$f":"IF(設定!$C$11=\"\",\"\",設定!$C$11)","v":"ママ"},null,{"$f":"IF(設定!$C$11=\"\",\"\",設定!$C$11)","v":"ママ"},null,{"$f":"IF(設定!$C$11=\"\",\"\",設定!$C$11)","v":"ママ"},null,{"$f":"IF(設定!$C$11=\"\",\"\",設定!$C$11)","v":"ママ"}]
[null,{"$f":"IF(設定!$C$12=\"\",\"\",設定!$C$12)","v":"さとる"},null,{"$f":"IF(設定!$C$12=\"\",\"\",設定!$C$12)","v":"さとる"},null,{"$f":"IF(設定!$C$12=\"\",\"\",設定!$C$12)","v":"さとる"},null,{"$f":"IF(設定!$C$12=\"\",\"\",設定!$C$12)","v":"さとる"},null,{"$f":"IF(設定!$C$12=\"\",\"\",設定!$C$12)","v":"さとる"},null,{"$f":"IF(設定!$C$12=\"\",\"\",設定!$C$12)","v":"さとる"},null,{"$f":"IF(設定!$C$12=\"\",\"\",設定!$C$12)","v":"さとる"}]
[null,{"$f":"IF(設定!$C$13=\"\",\"\",設定!$C$13)","v":"くるみ"},null,{"$f":"IF(設定!$C$13=\"\",\"\",設定!$C$13)","v":"くるみ"},null,{"$f":"IF(設定!$C$13=\"\",\"\",設定!$C$13)","v":"くるみ"},null,{"$f":"IF(設定!$C$13=\"\",\"\",設定!$C$13)","v":"くるみ"},null,{"$f":"IF(設定!$C$13=\"\",\"\",設定!$C$13)","v":"くるみ"},null,{"$f":"IF(設定!$C$13=\"\",\"\",設定!$C$13)","v":"くるみ"},null,{"$f":"IF(設定!$C$13=\"\",\"\",設定!$C$13)","v":"くるみ"}]
[null,{"$f":"IF(設定!$C$14=\"\",\"\",設定!$C$14)","v":"ともか"},null,{"$f":"IF(設定!$C$14=\"\",\"\",設定!$C$14)","v":"ともか"},null,{"$f":"IF(設定!$C$14=\"\",\"\",設定!$C$14)","v":"ともか"},null,{"$f":"IF(設定!$C$14=\"\",\"\",設定!$C$14)","v":"ともか"},null,{"$f":"IF(設定!$C$14=\"\",\"\",設定!$C$14)","v":"ともか"},null,{"$f":"IF(設定!$C$14=\"\",\"\",設定!$C$14)","v":"ともか"},null,{"$f":"IF(設定!$C$14=\"\",\"\",設定!$C$14)","v":"ともか"}]
[null,{"$f":"$B$5","v":"月"},null,{"$f":"$D$5","v":"火"},null,{"$f":"$F$5","v":"水"},null,{"$f":"$H$5","v":"木"},null,{"$f":"$J$5","v":"金"},null,{"$f":"$L$5","v":"土"},null,{"$f":"$N$5","v":"日"}]
[null,{"$f":"$N170+1","v":12},{"$f":"IF(ISERROR(VLOOKUP(DATE($E$159,$B$158,B178),Holiday,2,FALSE)),\"\",VLOOKUP(DATE($E$159,$B$158,B178),Holiday,2,FALSE))","v":""},{"$f":"B178+1","v":13},{"$f":"IF(ISERROR(VLOOKUP(DATE($E$159,$B$158,D178),Holiday,2,FALSE)),\"\",VLOOKUP(DATE($E$159,$B$158,D178),Holiday,2,FALSE))","v":""},{"$f":"D178+1","v":14},{"$f":"IF(ISERROR(VLOOKUP(DATE($E$159,$B$158,F178),Holiday,2,FALSE)),\"\",VLOOKUP(DATE($E$159,$B$158,F178),Holiday,2,FALSE))","v":""},{"$f":"F178+1","v":15},{"$f":"IF(ISERROR(VLOOKUP(DATE($E$159,$B$158,H178),Holiday,2,FALSE)),\"\",VLOOKUP(DATE($E$159,$B$158,H178),Holiday,2,FALSE))","v":""},{"$f":"H178+1","v":16},{"$f":"IF(ISERROR(VLOOKUP(DATE($E$159,$B$158,J178),Holiday,2,FALSE)),\"\",VLOOKUP(DATE($E$159,$B$158,J178),Holiday,2,FALSE))","v":""},{"$f":"J178+1","v":17},{"$f":"IF(ISERROR(VLOOKUP(DATE($E$159,$B$158,L178),Holiday,2,FALSE)),\"\",VLOOKUP(DATE($E$159,$B$158,L178),Holiday,2,FALSE))","v":""},{"$f":"L178+1","v":18},{"$f":"IF(ISERROR(VLOOKUP(DATE($E$159,$B$158,N178),Holiday,2,FALSE)),\"\",VLOOKUP(DATE($E$159,$B$158,N178),Holiday,2,FALSE))","v":""}]
[]
[null,{"$f":"IF(設定!$C$10=\"\",\"\",設定!$C$10)","v":"パパ"},null,{"$f":"IF(設定!$C$10=\"\",\"\",設定!$C$10)","v":"パパ"},null,{"$f":"IF(設定!$C$10=\"\",\"\",設定!$C$10)","v":"パパ"},null,{"$f":"IF(設定!$C$10=\"\",\"\",設定!$C$10)","v":"パパ"},null,{"$f":"IF(設定!$C$10=\"\",\"\",設定!$C$10)","v":"パパ"},null,{"$f":"IF(設定!$C$10=\"\",\"\",設定!$C$10)","v":"パパ"},null,{"$f":"IF(設定!$C$10=\"\",\"\",設定!$C$10)","v":"パパ"}]
[null,{"$f":"IF(設定!$C$11=\"\",\"\",設定!$C$11)","v":"ママ"},null,{"$f":"IF(設定!$C$11=\"\",\"\",設定!$C$11)","v":"ママ"},null,{"$f":"IF(設定!$C$11=\"\",\"\",設定!$C$11)","v":"ママ"},null,{"$f":"IF(設定!$C$11=\"\",\"\",設定!$C$11)","v":"ママ"},null,{"$f":"IF(設定!$C$11=\"\",\"\",設定!$C$11)","v":"ママ"},null,{"$f":"IF(設定!$C$11=\"\",\"\",設定!$C$11)","v":"ママ"},null,{"$f":"IF(設定!$C$11=\"\",\"\",設定!$C$11)","v":"ママ"}]
[null,{"$f":"IF(設定!$C$12=\"\",\"\",設定!$C$12)","v":"さとる"},null,{"$f":"IF(設定!$C$12=\"\",\"\",設定!$C$12)","v":"さとる"},null,{"$f":"IF(設定!$C$12=\"\",\"\",設定!$C$12)","v":"さとる"},null,{"$f":"IF(設定!$C$12=\"\",\"\",設定!$C$12)","v":"さとる"},null,{"$f":"IF(設定!$C$12=\"\",\"\",設定!$C$12)","v":"さとる"},null,{"$f":"IF(設定!$C$12=\"\",\"\",設定!$C$12)","v":"さとる"},null,{"$f":"IF(設定!$C$12=\"\",\"\",設定!$C$12)","v":"さとる"}]
[null,{"$f":"IF(設定!$C$13=\"\",\"\",設定!$C$13)","v":"くるみ"},null,{"$f":"IF(設定!$C$13=\"\",\"\",設定!$C$13)","v":"くるみ"},null,{"$f":"IF(設定!$C$13=\"\",\"\",設定!$C$13)","v":"くるみ"},null,{"$f":"IF(設定!$C$13=\"\",\"\",設定!$C$13)","v":"くるみ"},null,{"$f":"IF(設定!$C$13=\"\",\"\",設定!$C$13)","v":"くるみ"},null,{"$f":"IF(設定!$C$13=\"\",\"\",設定!$C$13)","v":"くるみ"},null,{"$f":"IF(設定!$C$13=\"\",\"\",設定!$C$13)","v":"くるみ"}]
[null,{"$f":"IF(設定!$C$14=\"\",\"\",設定!$C$14)","v":"ともか"},null,{"$f":"IF(設定!$C$14=\"\",\"\",設定!$C$14)","v":"ともか"},null,{"$f":"IF(設定!$C$14=\"\",\"\",設定!$C$14)","v":"ともか"},null,{"$f":"IF(設定!$C$14=\"\",\"\",設定!$C$14)","v":"ともか"},null,{"$f":"IF(設定!$C$14=\"\",\"\",設定!$C$14)","v":"ともか"},null,{"$f":"IF(設定!$C$14=\"\",\"\",設定!$C$14)","v":"ともか"},null,{"$f":"IF(設定!$C$14=\"\",\"\",設定!$C$14)","v":"ともか"}]
[null,{"$f":"$B$5","v":"月"},null,{"$f":"$D$5","v":"火"},null,{"$f":"$F$5","v":"水"},null,{"$f":"$H$5","v":"木"},null,{"$f":"$J$5","v":"金"},null,{"$f":"$L$5","v":"土"},null,{"$f":"$N$5","v":"日"}]
[null,{"$f":"$N178+1","v":19},{"$f":"IF(ISERROR(VLOOKUP(DATE($E$159,$B$158,B186),Holiday,2,FALSE)),\"\",VLOOKUP(DATE($E$159,$B$158,B186),Holiday,2,FALSE))","v":""},{"$f":"B186+1","v":20},{"$f":"IF(ISERROR(VLOOKUP(DATE($E$159,$B$158,D186),Holiday,2,FALSE)),\"\",VLOOKUP(DATE($E$159,$B$158,D186),Holiday,2,FALSE))","v":""},{"$f":"D186+1","v":21},{"$f":"IF(ISERROR(VLOOKUP(DATE($E$159,$B$158,F186),Holiday,2,FALSE)),\"\",VLOOKUP(DATE($E$159,$B$158,F186),Holiday,2,FALSE))","v":""},{"$f":"F186+1","v":22},{"$f":"IF(ISERROR(VLOOKUP(DATE($E$159,$B$158,H186),Holiday,2,FALSE)),\"\",VLOOKUP(DATE($E$159,$B$158,H186),Holiday,2,FALSE))","v":""},{"$f":"H186+1","v":23},{"$f":"IF(ISERROR(VLOOKUP(DATE($E$159,$B$158,J186),Holiday,2,FALSE)),\"\",VLOOKUP(DATE($E$159,$B$158,J186),Holiday,2,FALSE))","v":""},{"$f":"J186+1","v":24},{"$f":"IF(ISERROR(VLOOKUP(DATE($E$159,$B$158,L186),Holiday,2,FALSE)),\"\",VLOOKUP(DATE($E$159,$B$158,L186),Holiday,2,FALSE))","v":""},{"$f":"L186+1","v":25},{"$f":"IF(ISERROR(VLOOKUP(DATE($E$159,$B$158,N186),Holiday,2,FALSE)),\"\",VLOOKUP(DATE($E$159,$B$158,N186),Holiday,2,FALSE))","v":""}]
[]
[null,{"$f":"IF(設定!$C$10=\"\",\"\",設定!$C$10)","v":"パパ"},null,{"$f":"IF(設定!$C$10=\"\",\"\",設定!$C$10)","v":"パパ"},null,{"$f":"IF(設定!$C$10=\"\",\"\",設定!$C$10)","v":"パパ"},null,{"$f":"IF(設定!$C$10=\"\",\"\",設定!$C$10)","v":"パパ"},null,{"$f":"IF(設定!$C$10=\"\",\"\",設定!$C$10)","v":"パパ"},null,{"$f":"IF(設定!$C$10=\"\",\"\",設定!$C$10)","v":"パパ"},null,{"$f":"IF(設定!$C$10=\"\",\"\",設定!$C$10)","v":"パパ"}]
[null,{"$f":"IF(設定!$C$11=\"\",\"\",設定!$C$11)","v":"ママ"},null,{"$f":"IF(設定!$C$11=\"\",\"\",設定!$C$11)","v":"ママ"},null,{"$f":"IF(設定!$C$11=\"\",\"\",設定!$C$11)","v":"ママ"},null,{"$f":"IF(設定!$C$11=\"\",\"\",設定!$C$11)","v":"ママ"},null,{"$f":"IF(設定!$C$11=\"\",\"\",設定!$C$11)","v":"ママ"},null,{"$f":"IF(設定!$C$11=\"\",\"\",設定!$C$11)","v":"ママ"},null,{"$f":"IF(設定!$C$11=\"\",\"\",設定!$C$11)","v":"ママ"}]
[null,{"$f":"IF(設定!$C$12=\"\",\"\",設定!$C$12)","v":"さとる"},null,{"$f":"IF(設定!$C$12=\"\",\"\",設定!$C$12)","v":"さとる"},null,{"$f":"IF(設定!$C$12=\"\",\"\",設定!$C$12)","v":"さとる"},null,{"$f":"IF(設定!$C$12=\"\",\"\",設定!$C$12)","v":"さとる"},null,{"$f":"IF(設定!$C$12=\"\",\"\",設定!$C$12)","v":"さとる"},null,{"$f":"IF(設定!$C$12=\"\",\"\",設定!$C$12)","v":"さとる"},null,{"$f":"IF(設定!$C$12=\"\",\"\",設定!$C$12)","v":"さとる"}]
[null,{"$f":"IF(設定!$C$13=\"\",\"\",設定!$C$13)","v":"くるみ"},null,{"$f":"IF(設定!$C$13=\"\",\"\",設定!$C$13)","v":"くるみ"},null,{"$f":"IF(設定!$C$13=\"\",\"\",設定!$C$13)","v":"くるみ"},null,{"$f":"IF(設定!$C$13=\"\",\"\",設定!$C$13)","v":"くるみ"},null,{"$f":"IF(設定!$C$13=\"\",\"\",設定!$C$13)","v":"くるみ"},null,{"$f":"IF(設定!$C$13=\"\",\"\",設定!$C$13)","v":"くるみ"},null,{"$f":"IF(設定!$C$13=\"\",\"\",設定!$C$13)","v":"くるみ"}]
[null,{"$f":"IF(設定!$C$14=\"\",\"\",設定!$C$14)","v":"ともか"},null,{"$f":"IF(設定!$C$14=\"\",\"\",設定!$C$14)","v":"ともか"},null,{"$f":"IF(設定!$C$14=\"\",\"\",設定!$C$14)","v":"ともか"},null,{"$f":"IF(設定!$C$14=\"\",\"\",設定!$C$14)","v":"ともか"},null,{"$f":"IF(設定!$C$14=\"\",\"\",設定!$C$14)","v":"ともか"},null,{"$f":"IF(設定!$C$14=\"\",\"\",設定!$C$14)","v":"ともか"},null,{"$f":"IF(設定!$C$14=\"\",\"\",設定!$C$14)","v":"ともか"}]
[null,{"$f":"$B$5","v":"月"},null,{"$f":"$D$5","v":"火"},null,{"$f":"$F$5","v":"水"},null,{"$f":"$H$5","v":"木"},null,{"$f":"$J$5","v":"金"},null,{"$f":"$L$5","v":"土"},null,{"$f":"$N$5","v":"日"}]
[null,{"$f":"$N186+1","v":26},{"$f":"IF(ISERROR(VLOOKUP(DATE($E$159,$B$158,B194),Holiday,2,FALSE)),\"\",VLOOKUP(DATE($E$159,$B$158,B194),Holiday,2,FALSE))","v":""},{"$f":"B194+1","v":27},{"$f":"IF(ISERROR(VLOOKUP(DATE($E$159,$B$158,D194),Holiday,2,FALSE)),\"\",VLOOKUP(DATE($E$159,$B$158,D194),Holiday,2,FALSE))","v":""},{"$f":"D194+1","v":28},{"$f":"IF(ISERROR(VLOOKUP(DATE($E$159,$B$158,F194),Holiday,2,FALSE)),\"\",VLOOKUP(DATE($E$159,$B$158,F194),Holiday,2,FALSE))","v":""},{"$f":"F194+1","v":29},{"$f":"IF(ISERROR(VLOOKUP(DATE($E$159,$B$158,H194),Holiday,2,FALSE)),\"\",VLOOKUP(DATE($E$159,$B$158,H194),Holiday,2,FALSE))","v":"昭和の日"},{"$f":"H194+1","v":30},{"$f":"IF(ISERROR(VLOOKUP(DATE($E$159,$B$158,J194),Holiday,2,FALSE)),\"\",VLOOKUP(DATE($E$159,$B$158,J194),Holiday,2,FALSE))","v":""},{"$f":"J194+1","v":31},{"$f":"IF(ISERROR(VLOOKUP(DATE($E$159,$B$158,L194),Holiday,2,FALSE)),\"\",VLOOKUP(DATE($E$159,$B$158,L194),Holiday,2,FALSE))","v":""},{"$f":"L194+1","v":32},{"$f":"IF(ISERROR(VLOOKUP(DATE($E$159,$B$158,N194),Holiday,2,FALSE)),\"\",VLOOKUP(DATE($E$159,$B$158,N194),Holiday,2,FALSE))","v":""}]
[]
[null,{"$f":"IF(設定!$C$10=\"\",\"\",設定!$C$10)","v":"パパ"},null,{"$f":"IF(設定!$C$10=\"\",\"\",設定!$C$10)","v":"パパ"},null,{"$f":"IF(設定!$C$10=\"\",\"\",設定!$C$10)","v":"パパ"},null,{"$f":"IF(設定!$C$10=\"\",\"\",設定!$C$10)","v":"パパ"},null,{"$f":"IF(設定!$C$10=\"\",\"\",設定!$C$10)","v":"パパ"},null,{"$f":"IF(設定!$C$10=\"\",\"\",設定!$C$10)","v":"パパ"},null,{"$f":"IF(設定!$C$10=\"\",\"\",設定!$C$10)","v":"パパ"}]
[null,{"$f":"IF(設定!$C$11=\"\",\"\",設定!$C$11)","v":"ママ"},null,{"$f":"IF(設定!$C$11=\"\",\"\",設定!$C$11)","v":"ママ"},null,{"$f":"IF(設定!$C$11=\"\",\"\",設定!$C$11)","v":"ママ"},null,{"$f":"IF(設定!$C$11=\"\",\"\",設定!$C$11)","v":"ママ"},null,{"$f":"IF(設定!$C$11=\"\",\"\",設定!$C$11)","v":"ママ"},null,{"$f":"IF(設定!$C$11=\"\",\"\",設定!$C$11)","v":"ママ"},null,{"$f":"IF(設定!$C$11=\"\",\"\",設定!$C$11)","v":"ママ"}]
[null,{"$f":"IF(設定!$C$12=\"\",\"\",設定!$C$12)","v":"さとる"},null,{"$f":"IF(設定!$C$12=\"\",\"\",設定!$C$12)","v":"さとる"},null,{"$f":"IF(設定!$C$12=\"\",\"\",設定!$C$12)","v":"さとる"},null,{"$f":"IF(設定!$C$12=\"\",\"\",設定!$C$12)","v":"さとる"},null,{"$f":"IF(設定!$C$12=\"\",\"\",設定!$C$12)","v":"さとる"},null,{"$f":"IF(設定!$C$12=\"\",\"\",設定!$C$12)","v":"さとる"},null,{"$f":"IF(設定!$C$12=\"\",\"\",設定!$C$12)","v":"さとる"}]
[null,{"$f":"IF(設定!$C$13=\"\",\"\",設定!$C$13)","v":"くるみ"},null,{"$f":"IF(設定!$C$13=\"\",\"\",設定!$C$13)","v":"くるみ"},null,{"$f":"IF(設定!$C$13=\"\",\"\",設定!$C$13)","v":"くるみ"},null,{"$f":"IF(設定!$C$13=\"\",\"\",設定!$C$13)","v":"くるみ"},null,{"$f":"IF(設定!$C$13=\"\",\"\",設定!$C$13)","v":"くるみ"},null,{"$f":"IF(設定!$C$13=\"\",\"\",設定!$C$13)","v":"くるみ"},null,{"$f":"IF(設定!$C$13=\"\",\"\",設定!$C$13)","v":"くるみ"}]
[null,{"$f":"IF(設定!$C$14=\"\",\"\",設定!$C$14)","v":"ともか"},null,{"$f":"IF(設定!$C$14=\"\",\"\",設定!$C$14)","v":"ともか"},null,{"$f":"IF(設定!$C$14=\"\",\"\",設定!$C$14)","v":"ともか"},null,{"$f":"IF(設定!$C$14=\"\",\"\",設定!$C$14)","v":"ともか"},null,{"$f":"IF(設定!$C$14=\"\",\"\",設定!$C$14)","v":"ともか"},null,{"$f":"IF(設定!$C$14=\"\",\"\",設定!$C$14)","v":"ともか"},null,{"$f":"IF(設定!$C$14=\"\",\"\",設定!$C$14)","v":"ともか"}]
[null,{"$f":"$B$5","v":"月"},null,{"$f":"$D$5","v":"火"},null,{"$f":"$F$5","v":"水"},null,{"$f":"$H$5","v":"木"},null,{"$f":"$J$5","v":"金"},null,{"$f":"$L$5","v":"土"},null,{"$f":"$N$5","v":"日"}]
[null,{"$f":"$N194+1","v":33},{"$f":"IF(ISERROR(VLOOKUP(DATE($E$159,$B$158,B202),Holiday,2,FALSE)),\"\",VLOOKUP(DATE($E$159,$B$158,B202),Holiday,2,FALSE))","v":"憲法記念日"},{"$f":"B202+1","v":34},{"$f":"IF(ISERROR(VLOOKUP(DATE($E$159,$B$158,D202),Holiday,2,FALSE)),\"\",VLOOKUP(DATE($E$159,$B$158,D202),Holiday,2,FALSE))","v":"みどりの日"},{"$f":"D202+1","v":35},{"$f":"IF(ISERROR(VLOOKUP(DATE($E$159,$B$158,F202),Holiday,2,FALSE)),\"\",VLOOKUP(DATE($E$159,$B$158,F202),Holiday,2,FALSE))","v":"こどもの日"},{"$f":"F202+1","v":36},{"$f":"IF(ISERROR(VLOOKUP(DATE($E$159,$B$158,H202),Holiday,2,FALSE)),\"\",VLOOKUP(DATE($E$159,$B$158,H202),Holiday,2,FALSE))","v":""},{"$f":"H202+1","v":37},{"$f":"IF(ISERROR(VLOOKUP(DATE($E$159,$B$158,J202),Holiday,2,FALSE)),\"\",VLOOKUP(DATE($E$159,$B$158,J202),Holiday,2,FALSE))","v":""},{"$f":"J202+1","v":38},{"$f":"IF(ISERROR(VLOOKUP(DATE($E$159,$B$158,L202),Holiday,2,FALSE)),\"\",VLOOKUP(DATE($E$159,$B$158,L202),Holiday,2,FALSE))","v":""},{"$f":"L202+1","v":39},{"$f":"IF(ISERROR(VLOOKUP(DATE($E$159,$B$158,N202),Holiday,2,FALSE)),\"\",VLOOKUP(DATE($E$159,$B$158,N202),Holiday,2,FALSE))","v":""}]
[]
[null,{"$f":"IF(設定!$C$10=\"\",\"\",設定!$C$10)","v":"パパ"},null,{"$f":"IF(設定!$C$10=\"\",\"\",設定!$C$10)","v":"パパ"},null,{"$f":"IF(設定!$C$10=\"\",\"\",設定!$C$10)","v":"パパ"},null,{"$f":"IF(設定!$C$10=\"\",\"\",設定!$C$10)","v":"パパ"},null,{"$f":"IF(設定!$C$10=\"\",\"\",設定!$C$10)","v":"パパ"},null,{"$f":"IF(設定!$C$10=\"\",\"\",設定!$C$10)","v":"パパ"},null,{"$f":"IF(設定!$C$10=\"\",\"\",設定!$C$10)","v":"パパ"}]
[null,{"$f":"IF(設定!$C$11=\"\",\"\",設定!$C$11)","v":"ママ"},null,{"$f":"IF(設定!$C$11=\"\",\"\",設定!$C$11)","v":"ママ"},null,{"$f":"IF(設定!$C$11=\"\",\"\",設定!$C$11)","v":"ママ"},null,{"$f":"IF(設定!$C$11=\"\",\"\",設定!$C$11)","v":"ママ"},null,{"$f":"IF(設定!$C$11=\"\",\"\",設定!$C$11)","v":"ママ"},null,{"$f":"IF(設定!$C$11=\"\",\"\",設定!$C$11)","v":"ママ"},null,{"$f":"IF(設定!$C$11=\"\",\"\",設定!$C$11)","v":"ママ"}]
[null,{"$f":"IF(設定!$C$12=\"\",\"\",設定!$C$12)","v":"さとる"},null,{"$f":"IF(設定!$C$12=\"\",\"\",設定!$C$12)","v":"さとる"},null,{"$f":"IF(設定!$C$12=\"\",\"\",設定!$C$12)","v":"さとる"},null,{"$f":"IF(設定!$C$12=\"\",\"\",設定!$C$12)","v":"さとる"},null,{"$f":"IF(設定!$C$12=\"\",\"\",設定!$C$12)","v":"さとる"},null,{"$f":"IF(設定!$C$12=\"\",\"\",設定!$C$12)","v":"さとる"},null,{"$f":"IF(設定!$C$12=\"\",\"\",設定!$C$12)","v":"さとる"}]
[null,{"$f":"IF(設定!$C$13=\"\",\"\",設定!$C$13)","v":"くるみ"},null,{"$f":"IF(設定!$C$13=\"\",\"\",設定!$C$13)","v":"くるみ"},null,{"$f":"IF(設定!$C$13=\"\",\"\",設定!$C$13)","v":"くるみ"},null,{"$f":"IF(設定!$C$13=\"\",\"\",設定!$C$13)","v":"くるみ"},null,{"$f":"IF(設定!$C$13=\"\",\"\",設定!$C$13)","v":"くるみ"},null,{"$f":"IF(設定!$C$13=\"\",\"\",設定!$C$13)","v":"くるみ"},null,{"$f":"IF(設定!$C$13=\"\",\"\",設定!$C$13)","v":"くるみ"}]
[null,{"$f":"IF(設定!$C$14=\"\",\"\",設定!$C$14)","v":"ともか"},null,{"$f":"IF(設定!$C$14=\"\",\"\",設定!$C$14)","v":"ともか"},null,{"$f":"IF(設定!$C$14=\"\",\"\",設定!$C$14)","v":"ともか"},null,{"$f":"IF(設定!$C$14=\"\",\"\",設定!$C$14)","v":"ともか"},null,{"$f":"IF(設定!$C$14=\"\",\"\",設定!$C$14)","v":"ともか"},null,{"$f":"IF(設定!$C$14=\"\",\"\",設定!$C$14)","v":"ともか"},null,{"$f":"IF(設定!$C$14=\"\",\"\",設定!$C$14)","v":"ともか"}]
[2013]
[null,{"$f":"IF(B158+1>12,1,B158+1)","v":5}]
[null,{"$f":"CHOOSE($B210,\"January\",\"February\",\"March\",\"April\",\"May\",\"June\",\"July\",\"August\",\"September\",\"October\",\"November\",\"December\")","v":"May"},null,null,{"$f":"IF(B210=1,E159+1,E159)","v":2021}]
[]
[null,{"$f":"$B$5","v":"月"},null,{"$f":"$D$5","v":"火"},null,{"$f":"$F$5","v":"水"},null,{"$f":"$H$5","v":"木"},null,{"$f":"$J$5","v":"金"},null,{"$f":"$L$5","v":"土"},null,{"$f":"$N$5","v":"日"}]
[null,{"$f":"IF(IF(B213=\"日\",1,2)>=WEEKDAY(DATE($E211,$B210,1)),IF(IF(B213=\"日\",1,2)-WEEKDAY(DATE($E211,$B210,1))+1>1,\"\",IF(B213=\"日\",1,2)-WEEKDAY(DATE($E211,$B210,1))+1),\"\")","v":""},{"$f":"IF(ISERROR(VLOOKUP(DATE($E$211,$B$210,B214),Holiday,2,FALSE)),\"\",VLOOKUP(DATE($E$211,$B$210,B214),Holiday,2,FALSE))","v":""},{"$f":"IF(IF(D213=\"月\",2,3)>=WEEKDAY(DATE($E211,$B210,1)),IF(IF(D213=\"月\",2,3)-WEEKDAY(DATE($E211,$B210,1))+1>2,\"\",IF(D213=\"月\",2,3)-WEEKDAY(DATE($E211,$B210,1))+1),\"\")","v":""},{"$f":"IF(ISERROR(VLOOKUP(DATE($E$211,$B$210,D214),Holiday,2,FALSE)),\"\",VLOOKUP(DATE($E$211,$B$210,D214),Holiday,2,FALSE))","v":""},{"$f":"IF(IF(F213=\"火\",3,4)>=WEEKDAY(DATE($E211,$B210,1)),IF(IF(F213=\"火\",3,4)-WEEKDAY(DATE($E211,$B210,1))+1>3,\"\",IF(F213=\"火\",3,4)-WEEKDAY(DATE($E211,$B210,1))+1),\"\")","v":""},{"$f":"IF(ISERROR(VLOOKUP(DATE($E$211,$B$210,F214),Holiday,2,FALSE)),\"\",VLOOKUP(DATE($E$211,$B$210,F214),Holiday,2,FALSE))","v":""},{"$f":"IF(IF(H213=\"水\",4,5)>=WEEKDAY(DATE($E211,$B210,1)),IF(IF(H213=\"水\",4,5)-WEEKDAY(DATE($E211,$B210,1))+1>4,\"\",IF(H213=\"水\",4,5)-WEEKDAY(DATE($E211,$B210,1))+1),\"\")","v":""},{"$f":"IF(ISERROR(VLOOKUP(DATE($E$211,$B$210,H214),Holiday,2,FALSE)),\"\",VLOOKUP(DATE($E$211,$B$210,H214),Holiday,2,FALSE))","v":""},{"$f":"IF(IF(J213=\"木\",5,6)>=WEEKDAY(DATE($E211,$B210,1)),IF(IF(J213=\"木\",5,6)-WEEKDAY(DATE($E211,$B210,1))+1>5,\"\",IF(J213=\"木\",5,6)-WEEKDAY(DATE($E211,$B210,1))+1),\"\")","v":""},{"$f":"IF(ISERROR(VLOOKUP(DATE($E$211,$B$210,J214),Holiday,2,FALSE)),\"\",VLOOKUP(DATE($E$211,$B$210,J214),Holiday,2,FALSE))","v":""},{"$f":"IF(IF(L213=\"金\",6,7)>=WEEKDAY(DATE($E211,$B210,1)),IF(IF(L213=\"金\",6,7)-WEEKDAY(DATE($E211,$B210,1))+1>6,\"\",IF(L213=\"金\",6,7)-WEEKDAY(DATE($E211,$B210,1))+1),\"\")","v":1},{"$f":"IF(ISERROR(VLOOKUP(DATE($E$211,$B$210,L214),Holiday,2,FALSE)),\"\",VLOOKUP(DATE($E$211,$B$210,L214),Holiday,2,FALSE))","v":""},{"$f":"IF(L214=\"\",IF(IF(N213=\"土\",7,1)>=WEEKDAY(DATE($E211,$B210,1)),IF(N213=\"土\",7,1)-WEEKDAY(DATE($E211,$B210,1))+1),L214+1)","v":2},{"$f":"IF(ISERROR(VLOOKUP(DATE($E$211,$B$210,N214),Holiday,2,FALSE)),\"\",VLOOKUP(DATE($E$211,$B$210,N214),Holiday,2,FALSE))","v":""}]
[]
[null,{"$f":"IF(設定!$C$10=\"\",\"\",設定!$C$10)","v":"パパ"},null,{"$f":"IF(設定!$C$10=\"\",\"\",設定!$C$10)","v":"パパ"},null,{"$f":"IF(設定!$C$10=\"\",\"\",設定!$C$10)","v":"パパ"},null,{"$f":"IF(設定!$C$10=\"\",\"\",設定!$C$10)","v":"パパ"},null,{"$f":"IF(設定!$C$10=\"\",\"\",設定!$C$10)","v":"パパ"},null,{"$f":"IF(設定!$C$10=\"\",\"\",設定!$C$10)","v":"パパ"},null,{"$f":"IF(設定!$C$10=\"\",\"\",設定!$C$10)","v":"パパ"}]
[null,{"$f":"IF(設定!$C$11=\"\",\"\",設定!$C$11)","v":"ママ"},null,{"$f":"IF(設定!$C$11=\"\",\"\",設定!$C$11)","v":"ママ"},null,{"$f":"IF(設定!$C$11=\"\",\"\",設定!$C$11)","v":"ママ"},null,{"$f":"IF(設定!$C$11=\"\",\"\",設定!$C$11)","v":"ママ"},null,{"$f":"IF(設定!$C$11=\"\",\"\",設定!$C$11)","v":"ママ"},null,{"$f":"IF(設定!$C$11=\"\",\"\",設定!$C$11)","v":"ママ"},null,{"$f":"IF(設定!$C$11=\"\",\"\",設定!$C$11)","v":"ママ"}]
[null,{"$f":"IF(設定!$C$12=\"\",\"\",設定!$C$12)","v":"さとる"},null,{"$f":"IF(設定!$C$12=\"\",\"\",設定!$C$12)","v":"さとる"},null,{"$f":"IF(設定!$C$12=\"\",\"\",設定!$C$12)","v":"さとる"},null,{"$f":"IF(設定!$C$12=\"\",\"\",設定!$C$12)","v":"さとる"},null,{"$f":"IF(設定!$C$12=\"\",\"\",設定!$C$12)","v":"さとる"},null,{"$f":"IF(設定!$C$12=\"\",\"\",設定!$C$12)","v":"さとる"},null,{"$f":"IF(設定!$C$12=\"\",\"\",設定!$C$12)","v":"さとる"}]
[null,{"$f":"IF(設定!$C$13=\"\",\"\",設定!$C$13)","v":"くるみ"},null,{"$f":"IF(設定!$C$13=\"\",\"\",設定!$C$13)","v":"くるみ"},null,{"$f":"IF(設定!$C$13=\"\",\"\",設定!$C$13)","v":"くるみ"},null,{"$f":"IF(設定!$C$13=\"\",\"\",設定!$C$13)","v":"くるみ"},null,{"$f":"IF(設定!$C$13=\"\",\"\",設定!$C$13)","v":"くるみ"},null,{"$f":"IF(設定!$C$13=\"\",\"\",設定!$C$13)","v":"くるみ"},null,{"$f":"IF(設定!$C$13=\"\",\"\",設定!$C$13)","v":"くるみ"}]
[null,{"$f":"IF(設定!$C$14=\"\",\"\",設定!$C$14)","v":"ともか"},null,{"$f":"IF(設定!$C$14=\"\",\"\",設定!$C$14)","v":"ともか"},null,{"$f":"IF(設定!$C$14=\"\",\"\",設定!$C$14)","v":"ともか"},null,{"$f":"IF(設定!$C$14=\"\",\"\",設定!$C$14)","v":"ともか"},null,{"$f":"IF(設定!$C$14=\"\",\"\",設定!$C$14)","v":"ともか"},null,{"$f":"IF(設定!$C$14=\"\",\"\",設定!$C$14)","v":"ともか"},null,{"$f":"IF(設定!$C$14=\"\",\"\",設定!$C$14)","v":"ともか"}]
[null,{"$f":"$B$5","v":"月"},null,{"$f":"$D$5","v":"火"},null,{"$f":"$F$5","v":"水"},null,{"$f":"$H$5","v":"木"},null,{"$f":"$J$5","v":"金"},null,{"$f":"$L$5","v":"土"},null,{"$f":"$N$5","v":"日"}]
[null,{"$f":"$N214+1","v":3},{"$f":"IF(ISERROR(VLOOKUP(DATE($E$211,$B$210,B222),Holiday,2,FALSE)),\"\",VLOOKUP(DATE($E$159,$B$210,B222),Holiday,2,FALSE))","v":"憲法記念日"},{"$f":"B222+1","v":4},{"$f":"IF(ISERROR(VLOOKUP(DATE($E$211,$B$210,D222),Holiday,2,FALSE)),\"\",VLOOKUP(DATE($E$159,$B$210,D222),Holiday,2,FALSE))","v":"みどりの日"},{"$f":"D222+1","v":5},{"$f":"IF(ISERROR(VLOOKUP(DATE($E$211,$B$210,F222),Holiday,2,FALSE)),\"\",VLOOKUP(DATE($E$159,$B$210,F222),Holiday,2,FALSE))","v":"こどもの日"},{"$f":"F222+1","v":6},{"$f":"IF(ISERROR(VLOOKUP(DATE($E$211,$B$210,H222),Holiday,2,FALSE)),\"\",VLOOKUP(DATE($E$159,$B$210,H222),Holiday,2,FALSE))","v":""},{"$f":"H222+1","v":7},{"$f":"IF(ISERROR(VLOOKUP(DATE($E$211,$B$210,J222),Holiday,2,FALSE)),\"\",VLOOKUP(DATE($E$159,$B$210,J222),Holiday,2,FALSE))","v":""},{"$f":"J222+1","v":8},{"$f":"IF(ISERROR(VLOOKUP(DATE($E$211,$B$210,L222),Holiday,2,FALSE)),\"\",VLOOKUP(DATE($E$159,$B$210,L222),Holiday,2,FALSE))","v":""},{"$f":"L222+1","v":9},{"$f":"IF(ISERROR(VLOOKUP(DATE($E$211,$B$210,N222),Holiday,2,FALSE)),\"\",VLOOKUP(DATE($E$159,$B$210,N222),Holiday,2,FALSE))","v":""}]
[]
[null,{"$f":"IF(設定!$C$10=\"\",\"\",設定!$C$10)","v":"パパ"},null,{"$f":"IF(設定!$C$10=\"\",\"\",設定!$C$10)","v":"パパ"},null,{"$f":"IF(設定!$C$10=\"\",\"\",設定!$C$10)","v":"パパ"},null,{"$f":"IF(設定!$C$10=\"\",\"\",設定!$C$10)","v":"パパ"},null,{"$f":"IF(設定!$C$10=\"\",\"\",設定!$C$10)","v":"パパ"},null,{"$f":"IF(設定!$C$10=\"\",\"\",設定!$C$10)","v":"パパ"},null,{"$f":"IF(設定!$C$10=\"\",\"\",設定!$C$10)","v":"パパ"}]
[null,{"$f":"IF(設定!$C$11=\"\",\"\",設定!$C$11)","v":"ママ"},null,{"$f":"IF(設定!$C$11=\"\",\"\",設定!$C$11)","v":"ママ"},null,{"$f":"IF(設定!$C$11=\"\",\"\",設定!$C$11)","v":"ママ"},null,{"$f":"IF(設定!$C$11=\"\",\"\",設定!$C$11)","v":"ママ"},null,{"$f":"IF(設定!$C$11=\"\",\"\",設定!$C$11)","v":"ママ"},null,{"$f":"IF(設定!$C$11=\"\",\"\",設定!$C$11)","v":"ママ"},null,{"$f":"IF(設定!$C$11=\"\",\"\",設定!$C$11)","v":"ママ"}]
[null,{"$f":"IF(設定!$C$12=\"\",\"\",設定!$C$12)","v":"さとる"},null,{"$f":"IF(設定!$C$12=\"\",\"\",設定!$C$12)","v":"さとる"},null,{"$f":"IF(設定!$C$12=\"\",\"\",設定!$C$12)","v":"さとる"},null,{"$f":"IF(設定!$C$12=\"\",\"\",設定!$C$12)","v":"さとる"},null,{"$f":"IF(設定!$C$12=\"\",\"\",設定!$C$12)","v":"さとる"},null,{"$f":"IF(設定!$C$12=\"\",\"\",設定!$C$12)","v":"さとる"},null,{"$f":"IF(設定!$C$12=\"\",\"\",設定!$C$12)","v":"さとる"}]
[null,{"$f":"IF(設定!$C$13=\"\",\"\",設定!$C$13)","v":"くるみ"},null,{"$f":"IF(設定!$C$13=\"\",\"\",設定!$C$13)","v":"くるみ"},null,{"$f":"IF(設定!$C$13=\"\",\"\",設定!$C$13)","v":"くるみ"},null,{"$f":"IF(設定!$C$13=\"\",\"\",設定!$C$13)","v":"くるみ"},null,{"$f":"IF(設定!$C$13=\"\",\"\",設定!$C$13)","v":"くるみ"},null,{"$f":"IF(設定!$C$13=\"\",\"\",設定!$C$13)","v":"くるみ"},null,{"$f":"IF(設定!$C$13=\"\",\"\",設定!$C$13)","v":"くるみ"}]
[null,{"$f":"IF(設定!$C$14=\"\",\"\",設定!$C$14)","v":"ともか"},null,{"$f":"IF(設定!$C$14=\"\",\"\",設定!$C$14)","v":"ともか"},null,{"$f":"IF(設定!$C$14=\"\",\"\",設定!$C$14)","v":"ともか"},null,{"$f":"IF(設定!$C$14=\"\",\"\",設定!$C$14)","v":"ともか"},null,{"$f":"IF(設定!$C$14=\"\",\"\",設定!$C$14)","v":"ともか"},null,{"$f":"IF(設定!$C$14=\"\",\"\",設定!$C$14)","v":"ともか"},null,{"$f":"IF(設定!$C$14=\"\",\"\",設定!$C$14)","v":"ともか"}]
[null,{"$f":"$B$5","v":"月"},null,{"$f":"$D$5","v":"火"},null,{"$f":"$F$5","v":"水"},null,{"$f":"$H$5","v":"木"},null,{"$f":"$J$5","v":"金"},null,{"$f":"$L$5","v":"土"},null,{"$f":"$N$5","v":"日"}]
[null,{"$f":"$N222+1","v":10},{"$f":"IF(ISERROR(VLOOKUP(DATE($E$211,$B$210,B230),Holiday,2,FALSE)),\"\",VLOOKUP(DATE($E$159,$B$210,B230),Holiday,2,FALSE))","v":""},{"$f":"B230+1","v":11},{"$f":"IF(ISERROR(VLOOKUP(DATE($E$211,$B$210,D230),Holiday,2,FALSE)),\"\",VLOOKUP(DATE($E$159,$B$210,D230),Holiday,2,FALSE))","v":""},{"$f":"D230+1","v":12},{"$f":"IF(ISERROR(VLOOKUP(DATE($E$211,$B$210,F230),Holiday,2,FALSE)),\"\",VLOOKUP(DATE($E$159,$B$210,F230),Holiday,2,FALSE))","v":""},{"$f":"F230+1","v":13},{"$f":"IF(ISERROR(VLOOKUP(DATE($E$211,$B$210,H230),Holiday,2,FALSE)),\"\",VLOOKUP(DATE($E$159,$B$210,H230),Holiday,2,FALSE))","v":""},{"$f":"H230+1","v":14},{"$f":"IF(ISERROR(VLOOKUP(DATE($E$211,$B$210,J230),Holiday,2,FALSE)),\"\",VLOOKUP(DATE($E$159,$B$210,J230),Holiday,2,FALSE))","v":""},{"$f":"J230+1","v":15},{"$f":"IF(ISERROR(VLOOKUP(DATE($E$211,$B$210,L230),Holiday,2,FALSE)),\"\",VLOOKUP(DATE($E$159,$B$210,L230),Holiday,2,FALSE))","v":""},{"$f":"L230+1","v":16},{"$f":"IF(ISERROR(VLOOKUP(DATE($E$211,$B$210,N230),Holiday,2,FALSE)),\"\",VLOOKUP(DATE($E$159,$B$210,N230),Holiday,2,FALSE))","v":""}]
[]
[null,{"$f":"IF(設定!$C$10=\"\",\"\",設定!$C$10)","v":"パパ"},null,{"$f":"IF(設定!$C$10=\"\",\"\",設定!$C$10)","v":"パパ"},null,{"$f":"IF(設定!$C$10=\"\",\"\",設定!$C$10)","v":"パパ"},null,{"$f":"IF(設定!$C$10=\"\",\"\",設定!$C$10)","v":"パパ"},null,{"$f":"IF(設定!$C$10=\"\",\"\",設定!$C$10)","v":"パパ"},null,{"$f":"IF(設定!$C$10=\"\",\"\",設定!$C$10)","v":"パパ"},null,{"$f":"IF(設定!$C$10=\"\",\"\",設定!$C$10)","v":"パパ"}]
[null,{"$f":"IF(設定!$C$11=\"\",\"\",設定!$C$11)","v":"ママ"},null,{"$f":"IF(設定!$C$11=\"\",\"\",設定!$C$11)","v":"ママ"},null,{"$f":"IF(設定!$C$11=\"\",\"\",設定!$C$11)","v":"ママ"},null,{"$f":"IF(設定!$C$11=\"\",\"\",設定!$C$11)","v":"ママ"},null,{"$f":"IF(設定!$C$11=\"\",\"\",設定!$C$11)","v":"ママ"},null,{"$f":"IF(設定!$C$11=\"\",\"\",設定!$C$11)","v":"ママ"},null,{"$f":"IF(設定!$C$11=\"\",\"\",設定!$C$11)","v":"ママ"}]
[null,{"$f":"IF(設定!$C$12=\"\",\"\",設定!$C$12)","v":"さとる"},null,{"$f":"IF(設定!$C$12=\"\",\"\",設定!$C$12)","v":"さとる"},null,{"$f":"IF(設定!$C$12=\"\",\"\",設定!$C$12)","v":"さとる"},null,{"$f":"IF(設定!$C$12=\"\",\"\",設定!$C$12)","v":"さとる"},null,{"$f":"IF(設定!$C$12=\"\",\"\",設定!$C$12)","v":"さとる"},null,{"$f":"IF(設定!$C$12=\"\",\"\",設定!$C$12)","v":"さとる"},null,{"$f":"IF(設定!$C$12=\"\",\"\",設定!$C$12)","v":"さとる"}]
[null,{"$f":"IF(設定!$C$13=\"\",\"\",設定!$C$13)","v":"くるみ"},null,{"$f":"IF(設定!$C$13=\"\",\"\",設定!$C$13)","v":"くるみ"},null,{"$f":"IF(設定!$C$13=\"\",\"\",設定!$C$13)","v":"くるみ"},null,{"$f":"IF(設定!$C$13=\"\",\"\",設定!$C$13)","v":"くるみ"},null,{"$f":"IF(設定!$C$13=\"\",\"\",設定!$C$13)","v":"くるみ"},null,{"$f":"IF(設定!$C$13=\"\",\"\",設定!$C$13)","v":"くるみ"},null,{"$f":"IF(設定!$C$13=\"\",\"\",設定!$C$13)","v":"くるみ"}]
[null,{"$f":"IF(設定!$C$14=\"\",\"\",設定!$C$14)","v":"ともか"},null,{"$f":"IF(設定!$C$14=\"\",\"\",設定!$C$14)","v":"ともか"},null,{"$f":"IF(設定!$C$14=\"\",\"\",設定!$C$14)","v":"ともか"},null,{"$f":"IF(設定!$C$14=\"\",\"\",設定!$C$14)","v":"ともか"},null,{"$f":"IF(設定!$C$14=\"\",\"\",設定!$C$14)","v":"ともか"},null,{"$f":"IF(設定!$C$14=\"\",\"\",設定!$C$14)","v":"ともか"},null,{"$f":"IF(設定!$C$14=\"\",\"\",設定!$C$14)","v":"ともか"}]
[null,{"$f":"$B$5","v":"月"},null,{"$f":"$D$5","v":"火"},null,{"$f":"$F$5","v":"水"},null,{"$f":"$H$5","v":"木"},null,{"$f":"$J$5","v":"金"},null,{"$f":"$L$5","v":"土"},null,{"$f":"$N$5","v":"日"}]
[null,{"$f":"$N230+1","v":17},{"$f":"IF(ISERROR(VLOOKUP(DATE($E$211,$B$210,B238),Holiday,2,FALSE)),\"\",VLOOKUP(DATE($E$159,$B$210,B238),Holiday,2,FALSE))","v":""},{"$f":"B238+1","v":18},{"$f":"IF(ISERROR(VLOOKUP(DATE($E$211,$B$210,D238),Holiday,2,FALSE)),\"\",VLOOKUP(DATE($E$159,$B$210,D238),Holiday,2,FALSE))","v":""},{"$f":"D238+1","v":19},{"$f":"IF(ISERROR(VLOOKUP(DATE($E$211,$B$210,F238),Holiday,2,FALSE)),\"\",VLOOKUP(DATE($E$159,$B$210,F238),Holiday,2,FALSE))","v":""},{"$f":"F238+1","v":20},{"$f":"IF(ISERROR(VLOOKUP(DATE($E$211,$B$210,H238),Holiday,2,FALSE)),\"\",VLOOKUP(DATE($E$159,$B$210,H238),Holiday,2,FALSE))","v":""},{"$f":"H238+1","v":21},{"$f":"IF(ISERROR(VLOOKUP(DATE($E$211,$B$210,J238),Holiday,2,FALSE)),\"\",VLOOKUP(DATE($E$159,$B$210,J238),Holiday,2,FALSE))","v":""},{"$f":"J238+1","v":22},{"$f":"IF(ISERROR(VLOOKUP(DATE($E$211,$B$210,L238),Holiday,2,FALSE)),\"\",VLOOKUP(DATE($E$159,$B$210,L238),Holiday,2,FALSE))","v":""},{"$f":"L238+1","v":23},{"$f":"IF(ISERROR(VLOOKUP(DATE($E$211,$B$210,N238),Holiday,2,FALSE)),\"\",VLOOKUP(DATE($E$159,$B$210,N238),Holiday,2,FALSE))","v":""}]
[]
[null,{"$f":"IF(設定!$C$10=\"\",\"\",設定!$C$10)","v":"パパ"},null,{"$f":"IF(設定!$C$10=\"\",\"\",設定!$C$10)","v":"パパ"},null,{"$f":"IF(設定!$C$10=\"\",\"\",設定!$C$10)","v":"パパ"},null,{"$f":"IF(設定!$C$10=\"\",\"\",設定!$C$10)","v":"パパ"},null,{"$f":"IF(設定!$C$10=\"\",\"\",設定!$C$10)","v":"パパ"},null,{"$f":"IF(設定!$C$10=\"\",\"\",設定!$C$10)","v":"パパ"},null,{"$f":"IF(設定!$C$10=\"\",\"\",設定!$C$10)","v":"パパ"}]
[null,{"$f":"IF(設定!$C$11=\"\",\"\",設定!$C$11)","v":"ママ"},null,{"$f":"IF(設定!$C$11=\"\",\"\",設定!$C$11)","v":"ママ"},null,{"$f":"IF(設定!$C$11=\"\",\"\",設定!$C$11)","v":"ママ"},null,{"$f":"IF(設定!$C$11=\"\",\"\",設定!$C$11)","v":"ママ"},null,{"$f":"IF(設定!$C$11=\"\",\"\",設定!$C$11)","v":"ママ"},null,{"$f":"IF(設定!$C$11=\"\",\"\",設定!$C$11)","v":"ママ"},null,{"$f":"IF(設定!$C$11=\"\",\"\",設定!$C$11)","v":"ママ"}]
[null,{"$f":"IF(設定!$C$12=\"\",\"\",設定!$C$12)","v":"さとる"},null,{"$f":"IF(設定!$C$12=\"\",\"\",設定!$C$12)","v":"さとる"},null,{"$f":"IF(設定!$C$12=\"\",\"\",設定!$C$12)","v":"さとる"},null,{"$f":"IF(設定!$C$12=\"\",\"\",設定!$C$12)","v":"さとる"},null,{"$f":"IF(設定!$C$12=\"\",\"\",設定!$C$12)","v":"さとる"},null,{"$f":"IF(設定!$C$12=\"\",\"\",設定!$C$12)","v":"さとる"},null,{"$f":"IF(設定!$C$12=\"\",\"\",設定!$C$12)","v":"さとる"}]
[null,{"$f":"IF(設定!$C$13=\"\",\"\",設定!$C$13)","v":"くるみ"},null,{"$f":"IF(設定!$C$13=\"\",\"\",設定!$C$13)","v":"くるみ"},null,{"$f":"IF(設定!$C$13=\"\",\"\",設定!$C$13)","v":"くるみ"},null,{"$f":"IF(設定!$C$13=\"\",\"\",設定!$C$13)","v":"くるみ"},null,{"$f":"IF(設定!$C$13=\"\",\"\",設定!$C$13)","v":"くるみ"},null,{"$f":"IF(設定!$C$13=\"\",\"\",設定!$C$13)","v":"くるみ"},null,{"$f":"IF(設定!$C$13=\"\",\"\",設定!$C$13)","v":"くるみ"}]
[null,{"$f":"IF(設定!$C$14=\"\",\"\",設定!$C$14)","v":"ともか"},null,{"$f":"IF(設定!$C$14=\"\",\"\",設定!$C$14)","v":"ともか"},null,{"$f":"IF(設定!$C$14=\"\",\"\",設定!$C$14)","v":"ともか"},null,{"$f":"IF(設定!$C$14=\"\",\"\",設定!$C$14)","v":"ともか"},null,{"$f":"IF(設定!$C$14=\"\",\"\",設定!$C$14)","v":"ともか"},null,{"$f":"IF(設定!$C$14=\"\",\"\",設定!$C$14)","v":"ともか"},null,{"$f":"IF(設定!$C$14=\"\",\"\",設定!$C$14)","v":"ともか"}]
[null,{"$f":"$B$5","v":"月"},null,{"$f":"$D$5","v":"火"},null,{"$f":"$F$5","v":"水"},null,{"$f":"$H$5","v":"木"},null,{"$f":"$J$5","v":"金"},null,{"$f":"$L$5","v":"土"},null,{"$f":"$N$5","v":"日"}]
[null,{"$f":"$N238+1","v":24},{"$f":"IF(ISERROR(VLOOKUP(DATE($E$211,$B$210,B246),Holiday,2,FALSE)),\"\",VLOOKUP(DATE($E$159,$B$210,B246),Holiday,2,FALSE))","v":""},{"$f":"B246+1","v":25},{"$f":"IF(ISERROR(VLOOKUP(DATE($E$211,$B$210,D246),Holiday,2,FALSE)),\"\",VLOOKUP(DATE($E$159,$B$210,D246),Holiday,2,FALSE))","v":""},{"$f":"D246+1","v":26},{"$f":"IF(ISERROR(VLOOKUP(DATE($E$211,$B$210,F246),Holiday,2,FALSE)),\"\",VLOOKUP(DATE($E$159,$B$210,F246),Holiday,2,FALSE))","v":""},{"$f":"F246+1","v":27},{"$f":"IF(ISERROR(VLOOKUP(DATE($E$211,$B$210,H246),Holiday,2,FALSE)),\"\",VLOOKUP(DATE($E$159,$B$210,H246),Holiday,2,FALSE))","v":""},{"$f":"H246+1","v":28},{"$f":"IF(ISERROR(VLOOKUP(DATE($E$211,$B$210,J246),Holiday,2,FALSE)),\"\",VLOOKUP(DATE($E$159,$B$210,J246),Holiday,2,FALSE))","v":""},{"$f":"J246+1","v":29},{"$f":"IF(ISERROR(VLOOKUP(DATE($E$211,$B$210,L246),Holiday,2,FALSE)),\"\",VLOOKUP(DATE($E$159,$B$210,L246),Holiday,2,FALSE))","v":""},{"$f":"L246+1","v":30},{"$f":"IF(ISERROR(VLOOKUP(DATE($E$211,$B$210,N246),Holiday,2,FALSE)),\"\",VLOOKUP(DATE($E$159,$B$210,N246),Holiday,2,FALSE))","v":""}]
[]
[null,{"$f":"IF(設定!$C$10=\"\",\"\",設定!$C$10)","v":"パパ"},null,{"$f":"IF(設定!$C$10=\"\",\"\",設定!$C$10)","v":"パパ"},null,{"$f":"IF(設定!$C$10=\"\",\"\",設定!$C$10)","v":"パパ"},null,{"$f":"IF(設定!$C$10=\"\",\"\",設定!$C$10)","v":"パパ"},null,{"$f":"IF(設定!$C$10=\"\",\"\",設定!$C$10)","v":"パパ"},null,{"$f":"IF(設定!$C$10=\"\",\"\",設定!$C$10)","v":"パパ"},null,{"$f":"IF(設定!$C$10=\"\",\"\",設定!$C$10)","v":"パパ"}]
[null,{"$f":"IF(設定!$C$11=\"\",\"\",設定!$C$11)","v":"ママ"},null,{"$f":"IF(設定!$C$11=\"\",\"\",設定!$C$11)","v":"ママ"},null,{"$f":"IF(設定!$C$11=\"\",\"\",設定!$C$11)","v":"ママ"},null,{"$f":"IF(設定!$C$11=\"\",\"\",設定!$C$11)","v":"ママ"},null,{"$f":"IF(設定!$C$11=\"\",\"\",設定!$C$11)","v":"ママ"},null,{"$f":"IF(設定!$C$11=\"\",\"\",設定!$C$11)","v":"ママ"},null,{"$f":"IF(設定!$C$11=\"\",\"\",設定!$C$11)","v":"ママ"}]
[null,{"$f":"IF(設定!$C$12=\"\",\"\",設定!$C$12)","v":"さとる"},null,{"$f":"IF(設定!$C$12=\"\",\"\",設定!$C$12)","v":"さとる"},null,{"$f":"IF(設定!$C$12=\"\",\"\",設定!$C$12)","v":"さとる"},null,{"$f":"IF(設定!$C$12=\"\",\"\",設定!$C$12)","v":"さとる"},null,{"$f":"IF(設定!$C$12=\"\",\"\",設定!$C$12)","v":"さとる"},null,{"$f":"IF(設定!$C$12=\"\",\"\",設定!$C$12)","v":"さとる"},null,{"$f":"IF(設定!$C$12=\"\",\"\",設定!$C$12)","v":"さとる"}]
[null,{"$f":"IF(設定!$C$13=\"\",\"\",設定!$C$13)","v":"くるみ"},null,{"$f":"IF(設定!$C$13=\"\",\"\",設定!$C$13)","v":"くるみ"},null,{"$f":"IF(設定!$C$13=\"\",\"\",設定!$C$13)","v":"くるみ"},null,{"$f":"IF(設定!$C$13=\"\",\"\",設定!$C$13)","v":"くるみ"},null,{"$f":"IF(設定!$C$13=\"\",\"\",設定!$C$13)","v":"くるみ"},null,{"$f":"IF(設定!$C$13=\"\",\"\",設定!$C$13)","v":"くるみ"},null,{"$f":"IF(設定!$C$13=\"\",\"\",設定!$C$13)","v":"くるみ"}]
[null,{"$f":"IF(設定!$C$14=\"\",\"\",設定!$C$14)","v":"ともか"},null,{"$f":"IF(設定!$C$14=\"\",\"\",設定!$C$14)","v":"ともか"},null,{"$f":"IF(設定!$C$14=\"\",\"\",設定!$C$14)","v":"ともか"},null,{"$f":"IF(設定!$C$14=\"\",\"\",設定!$C$14)","v":"ともか"},null,{"$f":"IF(設定!$C$14=\"\",\"\",設定!$C$14)","v":"ともか"},null,{"$f":"IF(設定!$C$14=\"\",\"\",設定!$C$14)","v":"ともか"},null,{"$f":"IF(設定!$C$14=\"\",\"\",設定!$C$14)","v":"ともか"}]
[null,{"$f":"$B$5","v":"月"},null,{"$f":"$D$5","v":"火"},null,{"$f":"$F$5","v":"水"},null,{"$f":"$H$5","v":"木"},null,{"$f":"$J$5","v":"金"},null,{"$f":"$L$5","v":"土"},null,{"$f":"$N$5","v":"日"}]
[null,{"$f":"$N246+1","v":31},{"$f":"IF(ISERROR(VLOOKUP(DATE($E$211,$B$210,B254),Holiday,2,FALSE)),\"\",VLOOKUP(DATE($E$159,$B$210,B254),Holiday,2,FALSE))","v":""},{"$f":"B254+1","v":32},{"$f":"IF(ISERROR(VLOOKUP(DATE($E$211,$B$210,D254),Holiday,2,FALSE)),\"\",VLOOKUP(DATE($E$159,$B$210,D254),Holiday,2,FALSE))","v":""},{"$f":"D254+1","v":33},{"$f":"IF(ISERROR(VLOOKUP(DATE($E$211,$B$210,F254),Holiday,2,FALSE)),\"\",VLOOKUP(DATE($E$159,$B$210,F254),Holiday,2,FALSE))","v":""},{"$f":"F254+1","v":34},{"$f":"IF(ISERROR(VLOOKUP(DATE($E$211,$B$210,H254),Holiday,2,FALSE)),\"\",VLOOKUP(DATE($E$159,$B$210,H254),Holiday,2,FALSE))","v":""},{"$f":"H254+1","v":35},{"$f":"IF(ISERROR(VLOOKUP(DATE($E$211,$B$210,J254),Holiday,2,FALSE)),\"\",VLOOKUP(DATE($E$159,$B$210,J254),Holiday,2,FALSE))","v":""},{"$f":"J254+1","v":36},{"$f":"IF(ISERROR(VLOOKUP(DATE($E$211,$B$210,L254),Holiday,2,FALSE)),\"\",VLOOKUP(DATE($E$159,$B$210,L254),Holiday,2,FALSE))","v":""},{"$f":"L254+1","v":37},{"$f":"IF(ISERROR(VLOOKUP(DATE($E$211,$B$210,N254),Holiday,2,FALSE)),\"\",VLOOKUP(DATE($E$159,$B$210,N254),Holiday,2,FALSE))","v":""}]
[]
[null,{"$f":"IF(設定!$C$10=\"\",\"\",設定!$C$10)","v":"パパ"},null,{"$f":"IF(設定!$C$10=\"\",\"\",設定!$C$10)","v":"パパ"},null,{"$f":"IF(設定!$C$10=\"\",\"\",設定!$C$10)","v":"パパ"},null,{"$f":"IF(設定!$C$10=\"\",\"\",設定!$C$10)","v":"パパ"},null,{"$f":"IF(設定!$C$10=\"\",\"\",設定!$C$10)","v":"パパ"},null,{"$f":"IF(設定!$C$10=\"\",\"\",設定!$C$10)","v":"パパ"},null,{"$f":"IF(設定!$C$10=\"\",\"\",設定!$C$10)","v":"パパ"}]
[null,{"$f":"IF(設定!$C$11=\"\",\"\",設定!$C$11)","v":"ママ"},null,{"$f":"IF(設定!$C$11=\"\",\"\",設定!$C$11)","v":"ママ"},null,{"$f":"IF(設定!$C$11=\"\",\"\",設定!$C$11)","v":"ママ"},null,{"$f":"IF(設定!$C$11=\"\",\"\",設定!$C$11)","v":"ママ"},null,{"$f":"IF(設定!$C$11=\"\",\"\",設定!$C$11)","v":"ママ"},null,{"$f":"IF(設定!$C$11=\"\",\"\",設定!$C$11)","v":"ママ"},null,{"$f":"IF(設定!$C$11=\"\",\"\",設定!$C$11)","v":"ママ"}]
[null,{"$f":"IF(設定!$C$12=\"\",\"\",設定!$C$12)","v":"さとる"},null,{"$f":"IF(設定!$C$12=\"\",\"\",設定!$C$12)","v":"さとる"},null,{"$f":"IF(設定!$C$12=\"\",\"\",設定!$C$12)","v":"さとる"},null,{"$f":"IF(設定!$C$12=\"\",\"\",設定!$C$12)","v":"さとる"},null,{"$f":"IF(設定!$C$12=\"\",\"\",設定!$C$12)","v":"さとる"},null,{"$f":"IF(設定!$C$12=\"\",\"\",設定!$C$12)","v":"さとる"},null,{"$f":"IF(設定!$C$12=\"\",\"\",設定!$C$12)","v":"さとる"}]
[null,{"$f":"IF(設定!$C$13=\"\",\"\",設定!$C$13)","v":"くるみ"},null,{"$f":"IF(設定!$C$13=\"\",\"\",設定!$C$13)","v":"くるみ"},null,{"$f":"IF(設定!$C$13=\"\",\"\",設定!$C$13)","v":"くるみ"},null,{"$f":"IF(設定!$C$13=\"\",\"\",設定!$C$13)","v":"くるみ"},null,{"$f":"IF(設定!$C$13=\"\",\"\",設定!$C$13)","v":"くるみ"},null,{"$f":"IF(設定!$C$13=\"\",\"\",設定!$C$13)","v":"くるみ"},null,{"$f":"IF(設定!$C$13=\"\",\"\",設定!$C$13)","v":"くるみ"}]
[null,{"$f":"IF(設定!$C$14=\"\",\"\",設定!$C$14)","v":"ともか"},null,{"$f":"IF(設定!$C$14=\"\",\"\",設定!$C$14)","v":"ともか"},null,{"$f":"IF(設定!$C$14=\"\",\"\",設定!$C$14)","v":"ともか"},null,{"$f":"IF(設定!$C$14=\"\",\"\",設定!$C$14)","v":"ともか"},null,{"$f":"IF(設定!$C$14=\"\",\"\",設定!$C$14)","v":"ともか"},null,{"$f":"IF(設定!$C$14=\"\",\"\",設定!$C$14)","v":"ともか"},null,{"$f":"IF(設定!$C$14=\"\",\"\",設定!$C$14)","v":"ともか"}]
[2013]
[null,{"$f":"IF(B210+1>12,1,B210+1)","v":6}]
[null,{"$f":"CHOOSE($B262,\"January\",\"February\",\"March\",\"April\",\"May\",\"June\",\"July\",\"August\",\"September\",\"October\",\"November\",\"December\")","v":"June"},null,null,{"$f":"IF(B262=1,E211+1,E211)","v":2021}]
[]
[null,{"$f":"$B$5","v":"月"},null,{"$f":"$D$5","v":"火"},null,{"$f":"$F$5","v":"水"},null,{"$f":"$H$5","v":"木"},null,{"$f":"$J$5","v":"金"},null,{"$f":"$L$5","v":"土"},null,{"$f":"$N$5","v":"日"}]
[null,{"$f":"IF(IF(B265=\"日\",1,2)>=WEEKDAY(DATE($E263,$B262,1)),IF(IF(B265=\"日\",1,2)-WEEKDAY(DATE($E263,$B262,1))+1>1,\"\",IF(B265=\"日\",1,2)-WEEKDAY(DATE($E263,$B262,1))+1),\"\")","v":""},{"$f":"IF(ISERROR(VLOOKUP(DATE($E$263,$B$262,B266),Holiday,2,FALSE)),\"\",VLOOKUP(DATE($E$263,$B$262,B266),Holiday,2,FALSE))","v":""},{"$f":"IF(IF(D265=\"月\",2,3)>=WEEKDAY(DATE($E263,$B262,1)),IF(IF(D265=\"月\",2,3)-WEEKDAY(DATE($E263,$B262,1))+1>2,\"\",IF(D265=\"月\",2,3)-WEEKDAY(DATE($E263,$B262,1))+1),\"\")","v":1},{"$f":"IF(ISERROR(VLOOKUP(DATE($E$263,$B$262,D266),Holiday,2,FALSE)),\"\",VLOOKUP(DATE($E$263,$B$262,D266),Holiday,2,FALSE))","v":""},{"$f":"IF(IF(F265=\"月\",2,3)>=WEEKDAY(DATE($E263,$B262,1)),IF(IF(F265=\"月\",2,3)-WEEKDAY(DATE($E263,$B262,1))+1>2,\"\",IF(F265=\"月\",2,3)-WEEKDAY(DATE($E263,$B262,1))+1),\"\")","v":1},{"$f":"IF(ISERROR(VLOOKUP(DATE($E$263,$B$262,F266),Holiday,2,FALSE)),\"\",VLOOKUP(DATE($E$263,$B$262,F266),Holiday,2,FALSE))","v":""},{"$f":"IF(IF(H265=\"水\",4,5)>=WEEKDAY(DATE($E263,$B262,1)),IF(IF(H265=\"水\",4,5)-WEEKDAY(DATE($E263,$B262,1))+1>4,\"\",IF(H265=\"水\",4,5)-WEEKDAY(DATE($E263,$B262,1))+1),\"\")","v":3},{"$f":"IF(ISERROR(VLOOKUP(DATE($E$263,$B$262,H266),Holiday,2,FALSE)),\"\",VLOOKUP(DATE($E$263,$B$262,H266),Holiday,2,FALSE))","v":""},{"$f":"IF(IF(J265=\"木\",5,6)>=WEEKDAY(DATE($E263,$B262,1)),IF(IF(J265=\"木\",5,6)-WEEKDAY(DATE($E263,$B262,1))+1>5,\"\",IF(J265=\"木\",5,6)-WEEKDAY(DATE($E263,$B262,1))+1),\"\")","v":4},{"$f":"IF(ISERROR(VLOOKUP(DATE($E$263,$B$262,J266),Holiday,2,FALSE)),\"\",VLOOKUP(DATE($E$263,$B$262,J266),Holiday,2,FALSE))","v":""},{"$f":"IF(IF(L265=\"金\",6,7)>=WEEKDAY(DATE($E263,$B262,1)),IF(IF(L265=\"金\",6,7)-WEEKDAY(DATE($E263,$B262,1))+1>6,\"\",IF(L265=\"金\",6,7)-WEEKDAY(DATE($E263,$B262,1))+1),\"\")","v":5},{"$f":"IF(ISERROR(VLOOKUP(DATE($E$263,$B$262,L266),Holiday,2,FALSE)),\"\",VLOOKUP(DATE($E$263,$B$262,L266),Holiday,2,FALSE))","v":""},{"$f":"IF(L266=\"\",IF(IF(N265=\"土\",7,1)>=WEEKDAY(DATE($E263,$B262,1)),IF(N265=\"土\",7,1)-WEEKDAY(DATE($E263,$B262,1))+1),L266+1)","v":6},{"$f":"IF(ISERROR(VLOOKUP(DATE($E$263,$B$262,N266),Holiday,2,FALSE)),\"\",VLOOKUP(DATE($E$263,$B$262,N266),Holiday,2,FALSE))","v":""}]
[]
[null,{"$f":"IF(設定!$C$10=\"\",\"\",設定!$C$10)","v":"パパ"},null,{"$f":"IF(設定!$C$10=\"\",\"\",設定!$C$10)","v":"パパ"},null,{"$f":"IF(設定!$C$10=\"\",\"\",設定!$C$10)","v":"パパ"},null,{"$f":"IF(設定!$C$10=\"\",\"\",設定!$C$10)","v":"パパ"},null,{"$f":"IF(設定!$C$10=\"\",\"\",設定!$C$10)","v":"パパ"},null,{"$f":"IF(設定!$C$10=\"\",\"\",設定!$C$10)","v":"パパ"},null,{"$f":"IF(設定!$C$10=\"\",\"\",設定!$C$10)","v":"パパ"}]
[null,{"$f":"IF(設定!$C$11=\"\",\"\",設定!$C$11)","v":"ママ"},null,{"$f":"IF(設定!$C$11=\"\",\"\",設定!$C$11)","v":"ママ"},null,{"$f":"IF(設定!$C$11=\"\",\"\",設定!$C$11)","v":"ママ"},null,{"$f":"IF(設定!$C$11=\"\",\"\",設定!$C$11)","v":"ママ"},null,{"$f":"IF(設定!$C$11=\"\",\"\",設定!$C$11)","v":"ママ"},null,{"$f":"IF(設定!$C$11=\"\",\"\",設定!$C$11)","v":"ママ"},null,{"$f":"IF(設定!$C$11=\"\",\"\",設定!$C$11)","v":"ママ"}]
[null,{"$f":"IF(設定!$C$12=\"\",\"\",設定!$C$12)","v":"さとる"},null,{"$f":"IF(設定!$C$12=\"\",\"\",設定!$C$12)","v":"さとる"},null,{"$f":"IF(設定!$C$12=\"\",\"\",設定!$C$12)","v":"さとる"},null,{"$f":"IF(設定!$C$12=\"\",\"\",設定!$C$12)","v":"さとる"},null,{"$f":"IF(設定!$C$12=\"\",\"\",設定!$C$12)","v":"さとる"},null,{"$f":"IF(設定!$C$12=\"\",\"\",設定!$C$12)","v":"さとる"},null,{"$f":"IF(設定!$C$12=\"\",\"\",設定!$C$12)","v":"さとる"}]
[null,{"$f":"IF(設定!$C$13=\"\",\"\",設定!$C$13)","v":"くるみ"},null,{"$f":"IF(設定!$C$13=\"\",\"\",設定!$C$13)","v":"くるみ"},null,{"$f":"IF(設定!$C$13=\"\",\"\",設定!$C$13)","v":"くるみ"},null,{"$f":"IF(設定!$C$13=\"\",\"\",設定!$C$13)","v":"くるみ"},null,{"$f":"IF(設定!$C$13=\"\",\"\",設定!$C$13)","v":"くるみ"},null,{"$f":"IF(設定!$C$13=\"\",\"\",設定!$C$13)","v":"くるみ"},null,{"$f":"IF(設定!$C$13=\"\",\"\",設定!$C$13)","v":"くるみ"}]
[null,{"$f":"IF(設定!$C$14=\"\",\"\",設定!$C$14)","v":"ともか"},null,{"$f":"IF(設定!$C$14=\"\",\"\",設定!$C$14)","v":"ともか"},null,{"$f":"IF(設定!$C$14=\"\",\"\",設定!$C$14)","v":"ともか"},null,{"$f":"IF(設定!$C$14=\"\",\"\",設定!$C$14)","v":"ともか"},null,{"$f":"IF(設定!$C$14=\"\",\"\",設定!$C$14)","v":"ともか"},null,{"$f":"IF(設定!$C$14=\"\",\"\",設定!$C$14)","v":"ともか"},null,{"$f":"IF(設定!$C$14=\"\",\"\",設定!$C$14)","v":"ともか"}]
[null,{"$f":"$B$5","v":"月"},null,{"$f":"$D$5","v":"火"},null,{"$f":"$F$5","v":"水"},null,{"$f":"$H$5","v":"木"},null,{"$f":"$J$5","v":"金"},null,{"$f":"$L$5","v":"土"},null,{"$f":"$N$5","v":"日"}]
[null,{"$f":"$N266+1","v":7},{"$f":"IF(ISERROR(VLOOKUP(DATE($E$263,$B$262,B274),Holiday,2,FALSE)),\"\",VLOOKUP(DATE($E$263,$B$262,B274),Holiday,2,FALSE))","v":""},{"$f":"B274+1","v":8},{"$f":"IF(ISERROR(VLOOKUP(DATE($E$263,$B$262,D274),Holiday,2,FALSE)),\"\",VLOOKUP(DATE($E$263,$B$262,D274),Holiday,2,FALSE))","v":""},{"$f":"D274+1","v":9},{"$f":"IF(ISERROR(VLOOKUP(DATE($E$263,$B$262,F274),Holiday,2,FALSE)),\"\",VLOOKUP(DATE($E$263,$B$262,F274),Holiday,2,FALSE))","v":""},{"$f":"F274+1","v":10},{"$f":"IF(ISERROR(VLOOKUP(DATE($E$263,$B$262,H274),Holiday,2,FALSE)),\"\",VLOOKUP(DATE($E$263,$B$262,H274),Holiday,2,FALSE))","v":""},{"$f":"H274+1","v":11},{"$f":"IF(ISERROR(VLOOKUP(DATE($E$263,$B$262,J274),Holiday,2,FALSE)),\"\",VLOOKUP(DATE($E$263,$B$262,J274),Holiday,2,FALSE))","v":""},{"$f":"J274+1","v":12},{"$f":"IF(ISERROR(VLOOKUP(DATE($E$263,$B$262,L274),Holiday,2,FALSE)),\"\",VLOOKUP(DATE($E$263,$B$262,L274),Holiday,2,FALSE))","v":""},{"$f":"L274+1","v":13},{"$f":"IF(ISERROR(VLOOKUP(DATE($E$263,$B$262,N274),Holiday,2,FALSE)),\"\",VLOOKUP(DATE($E$263,$B$262,N274),Holiday,2,FALSE))","v":""}]
[]
[null,{"$f":"IF(設定!$C$10=\"\",\"\",設定!$C$10)","v":"パパ"},null,{"$f":"IF(設定!$C$10=\"\",\"\",設定!$C$10)","v":"パパ"},null,{"$f":"IF(設定!$C$10=\"\",\"\",設定!$C$10)","v":"パパ"},null,{"$f":"IF(設定!$C$10=\"\",\"\",設定!$C$10)","v":"パパ"},null,{"$f":"IF(設定!$C$10=\"\",\"\",設定!$C$10)","v":"パパ"},null,{"$f":"IF(設定!$C$10=\"\",\"\",設定!$C$10)","v":"パパ"},null,{"$f":"IF(設定!$C$10=\"\",\"\",設定!$C$10)","v":"パパ"}]
[null,{"$f":"IF(設定!$C$11=\"\",\"\",設定!$C$11)","v":"ママ"},null,{"$f":"IF(設定!$C$11=\"\",\"\",設定!$C$11)","v":"ママ"},null,{"$f":"IF(設定!$C$11=\"\",\"\",設定!$C$11)","v":"ママ"},null,{"$f":"IF(設定!$C$11=\"\",\"\",設定!$C$11)","v":"ママ"},null,{"$f":"IF(設定!$C$11=\"\",\"\",設定!$C$11)","v":"ママ"},null,{"$f":"IF(設定!$C$11=\"\",\"\",設定!$C$11)","v":"ママ"},null,{"$f":"IF(設定!$C$11=\"\",\"\",設定!$C$11)","v":"ママ"}]
[null,{"$f":"IF(設定!$C$12=\"\",\"\",設定!$C$12)","v":"さとる"},null,{"$f":"IF(設定!$C$12=\"\",\"\",設定!$C$12)","v":"さとる"},null,{"$f":"IF(設定!$C$12=\"\",\"\",設定!$C$12)","v":"さとる"},null,{"$f":"IF(設定!$C$12=\"\",\"\",設定!$C$12)","v":"さとる"},null,{"$f":"IF(設定!$C$12=\"\",\"\",設定!$C$12)","v":"さとる"},null,{"$f":"IF(設定!$C$12=\"\",\"\",設定!$C$12)","v":"さとる"},null,{"$f":"IF(設定!$C$12=\"\",\"\",設定!$C$12)","v":"さとる"}]
[null,{"$f":"IF(設定!$C$13=\"\",\"\",設定!$C$13)","v":"くるみ"},null,{"$f":"IF(設定!$C$13=\"\",\"\",設定!$C$13)","v":"くるみ"},null,{"$f":"IF(設定!$C$13=\"\",\"\",設定!$C$13)","v":"くるみ"},null,{"$f":"IF(設定!$C$13=\"\",\"\",設定!$C$13)","v":"くるみ"},null,{"$f":"IF(設定!$C$13=\"\",\"\",設定!$C$13)","v":"くるみ"},null,{"$f":"IF(設定!$C$13=\"\",\"\",設定!$C$13)","v":"くるみ"},null,{"$f":"IF(設定!$C$13=\"\",\"\",設定!$C$13)","v":"くるみ"}]
[null,{"$f":"IF(設定!$C$14=\"\",\"\",設定!$C$14)","v":"ともか"},null,{"$f":"IF(設定!$C$14=\"\",\"\",設定!$C$14)","v":"ともか"},null,{"$f":"IF(設定!$C$14=\"\",\"\",設定!$C$14)","v":"ともか"},null,{"$f":"IF(設定!$C$14=\"\",\"\",設定!$C$14)","v":"ともか"},null,{"$f":"IF(設定!$C$14=\"\",\"\",設定!$C$14)","v":"ともか"},null,{"$f":"IF(設定!$C$14=\"\",\"\",設定!$C$14)","v":"ともか"},null,{"$f":"IF(設定!$C$14=\"\",\"\",設定!$C$14)","v":"ともか"}]
[null,{"$f":"$B$5","v":"月"},null,{"$f":"$D$5","v":"火"},null,{"$f":"$F$5","v":"水"},null,{"$f":"$H$5","v":"木"},null,{"$f":"$J$5","v":"金"},null,{"$f":"$L$5","v":"土"},null,{"$f":"$N$5","v":"日"}]
[null,{"$f":"$N274+1","v":14},{"$f":"IF(ISERROR(VLOOKUP(DATE($E$263,$B$262,B282),Holiday,2,FALSE)),\"\",VLOOKUP(DATE($E$263,$B$262,B282),Holiday,2,FALSE))","v":""},{"$f":"B282+1","v":15},{"$f":"IF(ISERROR(VLOOKUP(DATE($E$263,$B$262,D282),Holiday,2,FALSE)),\"\",VLOOKUP(DATE($E$263,$B$262,D282),Holiday,2,FALSE))","v":""},{"$f":"D282+1","v":16},{"$f":"IF(ISERROR(VLOOKUP(DATE($E$263,$B$262,F282),Holiday,2,FALSE)),\"\",VLOOKUP(DATE($E$263,$B$262,F282),Holiday,2,FALSE))","v":""},{"$f":"F282+1","v":17},{"$f":"IF(ISERROR(VLOOKUP(DATE($E$263,$B$262,H282),Holiday,2,FALSE)),\"\",VLOOKUP(DATE($E$263,$B$262,H282),Holiday,2,FALSE))","v":""},{"$f":"H282+1","v":18},{"$f":"IF(ISERROR(VLOOKUP(DATE($E$263,$B$262,J282),Holiday,2,FALSE)),\"\",VLOOKUP(DATE($E$263,$B$262,J282),Holiday,2,FALSE))","v":""},{"$f":"J282+1","v":19},{"$f":"IF(ISERROR(VLOOKUP(DATE($E$263,$B$262,L282),Holiday,2,FALSE)),\"\",VLOOKUP(DATE($E$263,$B$262,L282),Holiday,2,FALSE))","v":""},{"$f":"L282+1","v":20},{"$f":"IF(ISERROR(VLOOKUP(DATE($E$263,$B$262,N282),Holiday,2,FALSE)),\"\",VLOOKUP(DATE($E$263,$B$262,N282),Holiday,2,FALSE))","v":""}]
[]
[null,{"$f":"IF(設定!$C$10=\"\",\"\",設定!$C$10)","v":"パパ"},null,{"$f":"IF(設定!$C$10=\"\",\"\",設定!$C$10)","v":"パパ"},null,{"$f":"IF(設定!$C$10=\"\",\"\",設定!$C$10)","v":"パパ"},null,{"$f":"IF(設定!$C$10=\"\",\"\",設定!$C$10)","v":"パパ"},null,{"$f":"IF(設定!$C$10=\"\",\"\",設定!$C$10)","v":"パパ"},null,{"$f":"IF(設定!$C$10=\"\",\"\",設定!$C$10)","v":"パパ"},null,{"$f":"IF(設定!$C$10=\"\",\"\",設定!$C$10)","v":"パパ"}]
[null,{"$f":"IF(設定!$C$11=\"\",\"\",設定!$C$11)","v":"ママ"},null,{"$f":"IF(設定!$C$11=\"\",\"\",設定!$C$11)","v":"ママ"},null,{"$f":"IF(設定!$C$11=\"\",\"\",設定!$C$11)","v":"ママ"},null,{"$f":"IF(設定!$C$11=\"\",\"\",設定!$C$11)","v":"ママ"},null,{"$f":"IF(設定!$C$11=\"\",\"\",設定!$C$11)","v":"ママ"},null,{"$f":"IF(設定!$C$11=\"\",\"\",設定!$C$11)","v":"ママ"},null,{"$f":"IF(設定!$C$11=\"\",\"\",設定!$C$11)","v":"ママ"}]
[null,{"$f":"IF(設定!$C$12=\"\",\"\",設定!$C$12)","v":"さとる"},null,{"$f":"IF(設定!$C$12=\"\",\"\",設定!$C$12)","v":"さとる"},null,{"$f":"IF(設定!$C$12=\"\",\"\",設定!$C$12)","v":"さとる"},null,{"$f":"IF(設定!$C$12=\"\",\"\",設定!$C$12)","v":"さとる"},null,{"$f":"IF(設定!$C$12=\"\",\"\",設定!$C$12)","v":"さとる"},null,{"$f":"IF(設定!$C$12=\"\",\"\",設定!$C$12)","v":"さとる"},null,{"$f":"IF(設定!$C$12=\"\",\"\",設定!$C$12)","v":"さとる"}]
[null,{"$f":"IF(設定!$C$13=\"\",\"\",設定!$C$13)","v":"くるみ"},null,{"$f":"IF(設定!$C$13=\"\",\"\",設定!$C$13)","v":"くるみ"},null,{"$f":"IF(設定!$C$13=\"\",\"\",設定!$C$13)","v":"くるみ"},null,{"$f":"IF(設定!$C$13=\"\",\"\",設定!$C$13)","v":"くるみ"},null,{"$f":"IF(設定!$C$13=\"\",\"\",設定!$C$13)","v":"くるみ"},null,{"$f":"IF(設定!$C$13=\"\",\"\",設定!$C$13)","v":"くるみ"},null,{"$f":"IF(設定!$C$13=\"\",\"\",設定!$C$13)","v":"くるみ"}]
[null,{"$f":"IF(設定!$C$14=\"\",\"\",設定!$C$14)","v":"ともか"},null,{"$f":"IF(設定!$C$14=\"\",\"\",設定!$C$14)","v":"ともか"},null,{"$f":"IF(設定!$C$14=\"\",\"\",設定!$C$14)","v":"ともか"},null,{"$f":"IF(設定!$C$14=\"\",\"\",設定!$C$14)","v":"ともか"},null,{"$f":"IF(設定!$C$14=\"\",\"\",設定!$C$14)","v":"ともか"},null,{"$f":"IF(設定!$C$14=\"\",\"\",設定!$C$14)","v":"ともか"},null,{"$f":"IF(設定!$C$14=\"\",\"\",設定!$C$14)","v":"ともか"}]
[null,{"$f":"$B$5","v":"月"},null,{"$f":"$D$5","v":"火"},null,{"$f":"$F$5","v":"水"},null,{"$f":"$H$5","v":"木"},null,{"$f":"$J$5","v":"金"},null,{"$f":"$L$5","v":"土"},null,{"$f":"$N$5","v":"日"}]
[null,{"$f":"$N282+1","v":21},{"$f":"IF(ISERROR(VLOOKUP(DATE($E$263,$B$262,B290),Holiday,2,FALSE)),\"\",VLOOKUP(DATE($E$263,$B$262,B290),Holiday,2,FALSE))","v":""},{"$f":"B290+1","v":22},{"$f":"IF(ISERROR(VLOOKUP(DATE($E$263,$B$262,D290),Holiday,2,FALSE)),\"\",VLOOKUP(DATE($E$263,$B$262,D290),Holiday,2,FALSE))","v":""},{"$f":"D290+1","v":23},{"$f":"IF(ISERROR(VLOOKUP(DATE($E$263,$B$262,F290),Holiday,2,FALSE)),\"\",VLOOKUP(DATE($E$263,$B$262,F290),Holiday,2,FALSE))","v":""},{"$f":"F290+1","v":24},{"$f":"IF(ISERROR(VLOOKUP(DATE($E$263,$B$262,H290),Holiday,2,FALSE)),\"\",VLOOKUP(DATE($E$263,$B$262,H290),Holiday,2,FALSE))","v":""},{"$f":"H290+1","v":25},{"$f":"IF(ISERROR(VLOOKUP(DATE($E$263,$B$262,J290),Holiday,2,FALSE)),\"\",VLOOKUP(DATE($E$263,$B$262,J290),Holiday,2,FALSE))","v":""},{"$f":"J290+1","v":26},{"$f":"IF(ISERROR(VLOOKUP(DATE($E$263,$B$262,L290),Holiday,2,FALSE)),\"\",VLOOKUP(DATE($E$263,$B$262,L290),Holiday,2,FALSE))","v":""},{"$f":"L290+1","v":27},{"$f":"IF(ISERROR(VLOOKUP(DATE($E$263,$B$262,N290),Holiday,2,FALSE)),\"\",VLOOKUP(DATE($E$263,$B$262,N290),Holiday,2,FALSE))","v":""}]
[]
[null,{"$f":"IF(設定!$C$10=\"\",\"\",設定!$C$10)","v":"パパ"},null,{"$f":"IF(設定!$C$10=\"\",\"\",設定!$C$10)","v":"パパ"},null,{"$f":"IF(設定!$C$10=\"\",\"\",設定!$C$10)","v":"パパ"},null,{"$f":"IF(設定!$C$10=\"\",\"\",設定!$C$10)","v":"パパ"},null,{"$f":"IF(設定!$C$10=\"\",\"\",設定!$C$10)","v":"パパ"},null,{"$f":"IF(設定!$C$10=\"\",\"\",設定!$C$10)","v":"パパ"},null,{"$f":"IF(設定!$C$10=\"\",\"\",設定!$C$10)","v":"パパ"}]
[null,{"$f":"IF(設定!$C$11=\"\",\"\",設定!$C$11)","v":"ママ"},null,{"$f":"IF(設定!$C$11=\"\",\"\",設定!$C$11)","v":"ママ"},null,{"$f":"IF(設定!$C$11=\"\",\"\",設定!$C$11)","v":"ママ"},null,{"$f":"IF(設定!$C$11=\"\",\"\",設定!$C$11)","v":"ママ"},null,{"$f":"IF(設定!$C$11=\"\",\"\",設定!$C$11)","v":"ママ"},null,{"$f":"IF(設定!$C$11=\"\",\"\",設定!$C$11)","v":"ママ"},null,{"$f":"IF(設定!$C$11=\"\",\"\",設定!$C$11)","v":"ママ"}]
[null,{"$f":"IF(設定!$C$12=\"\",\"\",設定!$C$12)","v":"さとる"},null,{"$f":"IF(設定!$C$12=\"\",\"\",設定!$C$12)","v":"さとる"},null,{"$f":"IF(設定!$C$12=\"\",\"\",設定!$C$12)","v":"さとる"},null,{"$f":"IF(設定!$C$12=\"\",\"\",設定!$C$12)","v":"さとる"},null,{"$f":"IF(設定!$C$12=\"\",\"\",設定!$C$12)","v":"さとる"},null,{"$f":"IF(設定!$C$12=\"\",\"\",設定!$C$12)","v":"さとる"},null,{"$f":"IF(設定!$C$12=\"\",\"\",設定!$C$12)","v":"さとる"}]
[null,{"$f":"IF(設定!$C$13=\"\",\"\",設定!$C$13)","v":"くるみ"},null,{"$f":"IF(設定!$C$13=\"\",\"\",設定!$C$13)","v":"くるみ"},null,{"$f":"IF(設定!$C$13=\"\",\"\",設定!$C$13)","v":"くるみ"},null,{"$f":"IF(設定!$C$13=\"\",\"\",設定!$C$13)","v":"くるみ"},null,{"$f":"IF(設定!$C$13=\"\",\"\",設定!$C$13)","v":"くるみ"},null,{"$f":"IF(設定!$C$13=\"\",\"\",設定!$C$13)","v":"くるみ"},null,{"$f":"IF(設定!$C$13=\"\",\"\",設定!$C$13)","v":"くるみ"}]
[null,{"$f":"IF(設定!$C$14=\"\",\"\",設定!$C$14)","v":"ともか"},null,{"$f":"IF(設定!$C$14=\"\",\"\",設定!$C$14)","v":"ともか"},null,{"$f":"IF(設定!$C$14=\"\",\"\",設定!$C$14)","v":"ともか"},null,{"$f":"IF(設定!$C$14=\"\",\"\",設定!$C$14)","v":"ともか"},null,{"$f":"IF(設定!$C$14=\"\",\"\",設定!$C$14)","v":"ともか"},null,{"$f":"IF(設定!$C$14=\"\",\"\",設定!$C$14)","v":"ともか"},null,{"$f":"IF(設定!$C$14=\"\",\"\",設定!$C$14)","v":"ともか"}]
[null,{"$f":"$B$5","v":"月"},null,{"$f":"$D$5","v":"火"},null,{"$f":"$F$5","v":"水"},null,{"$f":"$H$5","v":"木"},null,{"$f":"$J$5","v":"金"},null,{"$f":"$L$5","v":"土"},null,{"$f":"$N$5","v":"日"}]
[null,{"$f":"$N290+1","v":28},{"$f":"IF(ISERROR(VLOOKUP(DATE($E$263,$B$262,B298),Holiday,2,FALSE)),\"\",VLOOKUP(DATE($E$263,$B$262,B298),Holiday,2,FALSE))","v":""},{"$f":"B298+1","v":29},{"$f":"IF(ISERROR(VLOOKUP(DATE($E$263,$B$262,D298),Holiday,2,FALSE)),\"\",VLOOKUP(DATE($E$263,$B$262,D298),Holiday,2,FALSE))","v":""},{"$f":"D298+1","v":30},{"$f":"IF(ISERROR(VLOOKUP(DATE($E$263,$B$262,F298),Holiday,2,FALSE)),\"\",VLOOKUP(DATE($E$263,$B$262,F298),Holiday,2,FALSE))","v":""},{"$f":"F298+1","v":31},{"$f":"IF(ISERROR(VLOOKUP(DATE($E$263,$B$262,H298),Holiday,2,FALSE)),\"\",VLOOKUP(DATE($E$263,$B$262,H298),Holiday,2,FALSE))","v":""},{"$f":"H298+1","v":32},{"$f":"IF(ISERROR(VLOOKUP(DATE($E$263,$B$262,J298),Holiday,2,FALSE)),\"\",VLOOKUP(DATE($E$263,$B$262,J298),Holiday,2,FALSE))","v":""},{"$f":"J298+1","v":33},{"$f":"IF(ISERROR(VLOOKUP(DATE($E$263,$B$262,L298),Holiday,2,FALSE)),\"\",VLOOKUP(DATE($E$263,$B$262,L298),Holiday,2,FALSE))","v":""},{"$f":"L298+1","v":34},{"$f":"IF(ISERROR(VLOOKUP(DATE($E$263,$B$262,N298),Holiday,2,FALSE)),\"\",VLOOKUP(DATE($E$263,$B$262,N298),Holiday,2,FALSE))","v":""}]
[]
[null,{"$f":"IF(設定!$C$10=\"\",\"\",設定!$C$10)","v":"パパ"},null,{"$f":"IF(設定!$C$10=\"\",\"\",設定!$C$10)","v":"パパ"},null,{"$f":"IF(設定!$C$10=\"\",\"\",設定!$C$10)","v":"パパ"},null,{"$f":"IF(設定!$C$10=\"\",\"\",設定!$C$10)","v":"パパ"},null,{"$f":"IF(設定!$C$10=\"\",\"\",設定!$C$10)","v":"パパ"},null,{"$f":"IF(設定!$C$10=\"\",\"\",設定!$C$10)","v":"パパ"},null,{"$f":"IF(設定!$C$10=\"\",\"\",設定!$C$10)","v":"パパ"}]
[null,{"$f":"IF(設定!$C$11=\"\",\"\",設定!$C$11)","v":"ママ"},null,{"$f":"IF(設定!$C$11=\"\",\"\",設定!$C$11)","v":"ママ"},null,{"$f":"IF(設定!$C$11=\"\",\"\",設定!$C$11)","v":"ママ"},null,{"$f":"IF(設定!$C$11=\"\",\"\",設定!$C$11)","v":"ママ"},null,{"$f":"IF(設定!$C$11=\"\",\"\",設定!$C$11)","v":"ママ"},null,{"$f":"IF(設定!$C$11=\"\",\"\",設定!$C$11)","v":"ママ"},null,{"$f":"IF(設定!$C$11=\"\",\"\",設定!$C$11)","v":"ママ"}]
[null,{"$f":"IF(設定!$C$12=\"\",\"\",設定!$C$12)","v":"さとる"},null,{"$f":"IF(設定!$C$12=\"\",\"\",設定!$C$12)","v":"さとる"},null,{"$f":"IF(設定!$C$12=\"\",\"\",設定!$C$12)","v":"さとる"},null,{"$f":"IF(設定!$C$12=\"\",\"\",設定!$C$12)","v":"さとる"},null,{"$f":"IF(設定!$C$12=\"\",\"\",設定!$C$12)","v":"さとる"},null,{"$f":"IF(設定!$C$12=\"\",\"\",設定!$C$12)","v":"さとる"},null,{"$f":"IF(設定!$C$12=\"\",\"\",設定!$C$12)","v":"さとる"}]
[null,{"$f":"IF(設定!$C$13=\"\",\"\",設定!$C$13)","v":"くるみ"},null,{"$f":"IF(設定!$C$13=\"\",\"\",設定!$C$13)","v":"くるみ"},null,{"$f":"IF(設定!$C$13=\"\",\"\",設定!$C$13)","v":"くるみ"},null,{"$f":"IF(設定!$C$13=\"\",\"\",設定!$C$13)","v":"くるみ"},null,{"$f":"IF(設定!$C$13=\"\",\"\",設定!$C$13)","v":"くるみ"},null,{"$f":"IF(設定!$C$13=\"\",\"\",設定!$C$13)","v":"くるみ"},null,{"$f":"IF(設定!$C$13=\"\",\"\",設定!$C$13)","v":"くるみ"}]
[null,{"$f":"IF(設定!$C$14=\"\",\"\",設定!$C$14)","v":"ともか"},null,{"$f":"IF(設定!$C$14=\"\",\"\",設定!$C$14)","v":"ともか"},null,{"$f":"IF(設定!$C$14=\"\",\"\",設定!$C$14)","v":"ともか"},null,{"$f":"IF(設定!$C$14=\"\",\"\",設定!$C$14)","v":"ともか"},null,{"$f":"IF(設定!$C$14=\"\",\"\",設定!$C$14)","v":"ともか"},null,{"$f":"IF(設定!$C$14=\"\",\"\",設定!$C$14)","v":"ともか"},null,{"$f":"IF(設定!$C$14=\"\",\"\",設定!$C$14)","v":"ともか"}]
[null,{"$f":"$B$5","v":"月"},null,{"$f":"$D$5","v":"火"},null,{"$f":"$F$5","v":"水"},null,{"$f":"$H$5","v":"木"},null,{"$f":"$J$5","v":"金"},null,{"$f":"$L$5","v":"土"},null,{"$f":"$N$5","v":"日"}]
[null,{"$f":"$N298+1","v":35},{"$f":"IF(ISERROR(VLOOKUP(DATE($E$263,$B$262,B306),Holiday,2,FALSE)),\"\",VLOOKUP(DATE($E$263,$B$262,B306),Holiday,2,FALSE))","v":""},{"$f":"B306+1","v":36},{"$f":"IF(ISERROR(VLOOKUP(DATE($E$263,$B$262,D306),Holiday,2,FALSE)),\"\",VLOOKUP(DATE($E$263,$B$262,D306),Holiday,2,FALSE))","v":""},{"$f":"D306+1","v":37},{"$f":"IF(ISERROR(VLOOKUP(DATE($E$263,$B$262,F306),Holiday,2,FALSE)),\"\",VLOOKUP(DATE($E$263,$B$262,F306),Holiday,2,FALSE))","v":""},{"$f":"F306+1","v":38},{"$f":"IF(ISERROR(VLOOKUP(DATE($E$263,$B$262,H306),Holiday,2,FALSE)),\"\",VLOOKUP(DATE($E$263,$B$262,H306),Holiday,2,FALSE))","v":""},{"$f":"H306+1","v":39},{"$f":"IF(ISERROR(VLOOKUP(DATE($E$263,$B$262,J306),Holiday,2,FALSE)),\"\",VLOOKUP(DATE($E$263,$B$262,J306),Holiday,2,FALSE))","v":""},{"$f":"J306+1","v":40},{"$f":"IF(ISERROR(VLOOKUP(DATE($E$263,$B$262,L306),Holiday,2,FALSE)),\"\",VLOOKUP(DATE($E$263,$B$262,L306),Holiday,2,FALSE))","v":""},{"$f":"L306+1","v":41},{"$f":"IF(ISERROR(VLOOKUP(DATE($E$263,$B$262,N306),Holiday,2,FALSE)),\"\",VLOOKUP(DATE($E$263,$B$262,N306),Holiday,2,FALSE))","v":""}]
[]
[null,{"$f":"IF(設定!$C$10=\"\",\"\",設定!$C$10)","v":"パパ"},null,{"$f":"IF(設定!$C$10=\"\",\"\",設定!$C$10)","v":"パパ"},null,{"$f":"IF(設定!$C$10=\"\",\"\",設定!$C$10)","v":"パパ"},null,{"$f":"IF(設定!$C$10=\"\",\"\",設定!$C$10)","v":"パパ"},null,{"$f":"IF(設定!$C$10=\"\",\"\",設定!$C$10)","v":"パパ"},null,{"$f":"IF(設定!$C$10=\"\",\"\",設定!$C$10)","v":"パパ"},null,{"$f":"IF(設定!$C$10=\"\",\"\",設定!$C$10)","v":"パパ"}]
[null,{"$f":"IF(設定!$C$11=\"\",\"\",設定!$C$11)","v":"ママ"},null,{"$f":"IF(設定!$C$11=\"\",\"\",設定!$C$11)","v":"ママ"},null,{"$f":"IF(設定!$C$11=\"\",\"\",設定!$C$11)","v":"ママ"},null,{"$f":"IF(設定!$C$11=\"\",\"\",設定!$C$11)","v":"ママ"},null,{"$f":"IF(設定!$C$11=\"\",\"\",設定!$C$11)","v":"ママ"},null,{"$f":"IF(設定!$C$11=\"\",\"\",設定!$C$11)","v":"ママ"},null,{"$f":"IF(設定!$C$11=\"\",\"\",設定!$C$11)","v":"ママ"}]
[null,{"$f":"IF(設定!$C$12=\"\",\"\",設定!$C$12)","v":"さとる"},null,{"$f":"IF(設定!$C$12=\"\",\"\",設定!$C$12)","v":"さとる"},null,{"$f":"IF(設定!$C$12=\"\",\"\",設定!$C$12)","v":"さとる"},null,{"$f":"IF(設定!$C$12=\"\",\"\",設定!$C$12)","v":"さとる"},null,{"$f":"IF(設定!$C$12=\"\",\"\",設定!$C$12)","v":"さとる"},null,{"$f":"IF(設定!$C$12=\"\",\"\",設定!$C$12)","v":"さとる"},null,{"$f":"IF(設定!$C$12=\"\",\"\",設定!$C$12)","v":"さとる"}]
[null,{"$f":"IF(設定!$C$13=\"\",\"\",設定!$C$13)","v":"くるみ"},null,{"$f":"IF(設定!$C$13=\"\",\"\",設定!$C$13)","v":"くるみ"},null,{"$f":"IF(設定!$C$13=\"\",\"\",設定!$C$13)","v":"くるみ"},null,{"$f":"IF(設定!$C$13=\"\",\"\",設定!$C$13)","v":"くるみ"},null,{"$f":"IF(設定!$C$13=\"\",\"\",設定!$C$13)","v":"くるみ"},null,{"$f":"IF(設定!$C$13=\"\",\"\",設定!$C$13)","v":"くるみ"},null,{"$f":"IF(設定!$C$13=\"\",\"\",設定!$C$13)","v":"くるみ"}]
[null,{"$f":"IF(設定!$C$14=\"\",\"\",設定!$C$14)","v":"ともか"},null,{"$f":"IF(設定!$C$14=\"\",\"\",設定!$C$14)","v":"ともか"},null,{"$f":"IF(設定!$C$14=\"\",\"\",設定!$C$14)","v":"ともか"},null,{"$f":"IF(設定!$C$14=\"\",\"\",設定!$C$14)","v":"ともか"},null,{"$f":"IF(設定!$C$14=\"\",\"\",設定!$C$14)","v":"ともか"},null,{"$f":"IF(設定!$C$14=\"\",\"\",設定!$C$14)","v":"ともか"},null,{"$f":"IF(設定!$C$14=\"\",\"\",設定!$C$14)","v":"ともか"}]
[2013]
[null,{"$f":"IF(B262+1>12,1,B262+1)","v":7}]
[null,{"$f":"CHOOSE($B314,\"January\",\"February\",\"March\",\"April\",\"May\",\"June\",\"July\",\"August\",\"September\",\"October\",\"November\",\"December\")","v":"July"},null,null,{"$f":"IF(B314=1,E263+1,E263)","v":2021}]
[]
[null,{"$f":"$B$5","v":"月"},null,{"$f":"$D$5","v":"火"},null,{"$f":"$F$5","v":"水"},null,{"$f":"$H$5","v":"木"},null,{"$f":"$J$5","v":"金"},null,{"$f":"$L$5","v":"土"},null,{"$f":"$N$5","v":"日"}]
[null,{"$f":"IF(IF(B317=\"日\",1,2)>=WEEKDAY(DATE($E315,$B314,1)),IF(IF(B317=\"日\",1,2)-WEEKDAY(DATE($E315,$B314,1))+1>1,\"\",IF(B317=\"日\",1,2)-WEEKDAY(DATE($E315,$B314,1))+1),\"\")","v":""},{"$f":"IF(ISERROR(VLOOKUP(DATE($E$315,$B$314,B318),Holiday,2,FALSE)),\"\",VLOOKUP(DATE($E$315,$B$314,B318),Holiday,2,FALSE))","v":""},{"$f":"IF(IF(D317=\"月\",2,3)>=WEEKDAY(DATE($E315,$B314,1)),IF(IF(D317=\"月\",2,3)-WEEKDAY(DATE($E315,$B314,1))+1>2,\"\",IF(D317=\"月\",2,3)-WEEKDAY(DATE($E315,$B314,1))+1),\"\")","v":""},{"$f":"IF(ISERROR(VLOOKUP(DATE($E$315,$B$314,D318),Holiday,2,FALSE)),\"\",VLOOKUP(DATE($E$315,$B$314,D318),Holiday,2,FALSE))","v":""},{"$f":"IF(IF(F317=\"火\",3,4)>=WEEKDAY(DATE($E315,$B314,1)),IF(IF(F317=\"火\",3,4)-WEEKDAY(DATE($E315,$B314,1))+1>3,\"\",IF(F317=\"火\",3,4)-WEEKDAY(DATE($E315,$B314,1))+1),\"\")","v":""},{"$f":"IF(ISERROR(VLOOKUP(DATE($E$315,$B$314,F318),Holiday,2,FALSE)),\"\",VLOOKUP(DATE($E$315,$B$314,F318),Holiday,2,FALSE))","v":""},{"$f":"IF(IF(H317=\"水\",4,5)>=WEEKDAY(DATE($E315,$B314,1)),IF(IF(H317=\"水\",4,5)-WEEKDAY(DATE($E315,$B314,1))+1>4,\"\",IF(H317=\"水\",4,5)-WEEKDAY(DATE($E315,$B314,1))+1),\"\")","v":1},{"$f":"IF(ISERROR(VLOOKUP(DATE($E$315,$B$314,H318),Holiday,2,FALSE)),\"\",VLOOKUP(DATE($E$315,$B$314,H318),Holiday,2,FALSE))","v":""},{"$f":"IF(IF(J317=\"木\",5,6)>=WEEKDAY(DATE($E315,$B314,1)),IF(IF(J317=\"木\",5,6)-WEEKDAY(DATE($E315,$B314,1))+1>5,\"\",IF(J317=\"木\",5,6)-WEEKDAY(DATE($E315,$B314,1))+1),\"\")","v":2},{"$f":"IF(ISERROR(VLOOKUP(DATE($E$315,$B$314,J318),Holiday,2,FALSE)),\"\",VLOOKUP(DATE($E$315,$B$314,J318),Holiday,2,FALSE))","v":""},{"$f":"IF(IF(L317=\"金\",6,7)>=WEEKDAY(DATE($E315,$B314,1)),IF(IF(L317=\"金\",6,7)-WEEKDAY(DATE($E315,$B314,1))+1>6,\"\",IF(L317=\"金\",6,7)-WEEKDAY(DATE($E315,$B314,1))+1),\"\")","v":3},{"$f":"IF(ISERROR(VLOOKUP(DATE($E$315,$B$314,L318),Holiday,2,FALSE)),\"\",VLOOKUP(DATE($E$315,$B$314,L318),Holiday,2,FALSE))","v":""},{"$f":"IF(L318=\"\",IF(IF(N317=\"土\",7,1)>=WEEKDAY(DATE($E315,$B314,1)),IF(N317=\"土\",7,1)-WEEKDAY(DATE($E315,$B314,1))+1),L318+1)","v":4},{"$f":"IF(ISERROR(VLOOKUP(DATE($E$315,$B$314,N318),Holiday,2,FALSE)),\"\",VLOOKUP(DATE($E$315,$B$314,N318),Holiday,2,FALSE))","v":""}]
[]
[null,{"$f":"IF(設定!$C$10=\"\",\"\",設定!$C$10)","v":"パパ"},null,{"$f":"IF(設定!$C$10=\"\",\"\",設定!$C$10)","v":"パパ"},null,{"$f":"IF(設定!$C$10=\"\",\"\",設定!$C$10)","v":"パパ"},null,{"$f":"IF(設定!$C$10=\"\",\"\",設定!$C$10)","v":"パパ"},null,{"$f":"IF(設定!$C$10=\"\",\"\",設定!$C$10)","v":"パパ"},null,{"$f":"IF(設定!$C$10=\"\",\"\",設定!$C$10)","v":"パパ"},null,{"$f":"IF(設定!$C$10=\"\",\"\",設定!$C$10)","v":"パパ"}]
[null,{"$f":"IF(設定!$C$11=\"\",\"\",設定!$C$11)","v":"ママ"},null,{"$f":"IF(設定!$C$11=\"\",\"\",設定!$C$11)","v":"ママ"},null,{"$f":"IF(設定!$C$11=\"\",\"\",設定!$C$11)","v":"ママ"},null,{"$f":"IF(設定!$C$11=\"\",\"\",設定!$C$11)","v":"ママ"},null,{"$f":"IF(設定!$C$11=\"\",\"\",設定!$C$11)","v":"ママ"},null,{"$f":"IF(設定!$C$11=\"\",\"\",設定!$C$11)","v":"ママ"},null,{"$f":"IF(設定!$C$11=\"\",\"\",設定!$C$11)","v":"ママ"}]
[null,{"$f":"IF(設定!$C$12=\"\",\"\",設定!$C$12)","v":"さとる"},null,{"$f":"IF(設定!$C$12=\"\",\"\",設定!$C$12)","v":"さとる"},null,{"$f":"IF(設定!$C$12=\"\",\"\",設定!$C$12)","v":"さとる"},null,{"$f":"IF(設定!$C$12=\"\",\"\",設定!$C$12)","v":"さとる"},null,{"$f":"IF(設定!$C$12=\"\",\"\",設定!$C$12)","v":"さとる"},null,{"$f":"IF(設定!$C$12=\"\",\"\",設定!$C$12)","v":"さとる"},null,{"$f":"IF(設定!$C$12=\"\",\"\",設定!$C$12)","v":"さとる"}]
[null,{"$f":"IF(設定!$C$13=\"\",\"\",設定!$C$13)","v":"くるみ"},null,{"$f":"IF(設定!$C$13=\"\",\"\",設定!$C$13)","v":"くるみ"},null,{"$f":"IF(設定!$C$13=\"\",\"\",設定!$C$13)","v":"くるみ"},null,{"$f":"IF(設定!$C$13=\"\",\"\",設定!$C$13)","v":"くるみ"},null,{"$f":"IF(設定!$C$13=\"\",\"\",設定!$C$13)","v":"くるみ"},null,{"$f":"IF(設定!$C$13=\"\",\"\",設定!$C$13)","v":"くるみ"},null,{"$f":"IF(設定!$C$13=\"\",\"\",設定!$C$13)","v":"くるみ"}]
[null,{"$f":"IF(設定!$C$14=\"\",\"\",設定!$C$14)","v":"ともか"},null,{"$f":"IF(設定!$C$14=\"\",\"\",設定!$C$14)","v":"ともか"},null,{"$f":"IF(設定!$C$14=\"\",\"\",設定!$C$14)","v":"ともか"},null,{"$f":"IF(設定!$C$14=\"\",\"\",設定!$C$14)","v":"ともか"},null,{"$f":"IF(設定!$C$14=\"\",\"\",設定!$C$14)","v":"ともか"},null,{"$f":"IF(設定!$C$14=\"\",\"\",設定!$C$14)","v":"ともか"},null,{"$f":"IF(設定!$C$14=\"\",\"\",設定!$C$14)","v":"ともか"}]
[null,{"$f":"$B$5","v":"月"},null,{"$f":"$D$5","v":"火"},null,{"$f":"$F$5","v":"水"},null,{"$f":"$H$5","v":"木"},null,{"$f":"$J$5","v":"金"},null,{"$f":"$L$5","v":"土"},null,{"$f":"$N$5","v":"日"}]
[null,{"$f":"$N318+1","v":5},{"$f":"IF(ISERROR(VLOOKUP(DATE($E$315,$B$314,B326),Holiday,2,FALSE)),\"\",VLOOKUP(DATE($E$315,$B$314,B326),Holiday,2,FALSE))","v":""},{"$f":"B326+1","v":6},{"$f":"IF(ISERROR(VLOOKUP(DATE($E$315,$B$314,D326),Holiday,2,FALSE)),\"\",VLOOKUP(DATE($E$315,$B$314,D326),Holiday,2,FALSE))","v":""},{"$f":"D326+1","v":7},{"$f":"IF(ISERROR(VLOOKUP(DATE($E$315,$B$314,F326),Holiday,2,FALSE)),\"\",VLOOKUP(DATE($E$315,$B$314,F326),Holiday,2,FALSE))","v":""},{"$f":"F326+1","v":8},{"$f":"IF(ISERROR(VLOOKUP(DATE($E$315,$B$314,H326),Holiday,2,FALSE)),\"\",VLOOKUP(DATE($E$315,$B$314,H326),Holiday,2,FALSE))","v":""},{"$f":"H326+1","v":9},{"$f":"IF(ISERROR(VLOOKUP(DATE($E$315,$B$314,J326),Holiday,2,FALSE)),\"\",VLOOKUP(DATE($E$315,$B$314,J326),Holiday,2,FALSE))","v":""},{"$f":"J326+1","v":10},{"$f":"IF(ISERROR(VLOOKUP(DATE($E$315,$B$314,L326),Holiday,2,FALSE)),\"\",VLOOKUP(DATE($E$315,$B$314,L326),Holiday,2,FALSE))","v":""},{"$f":"L326+1","v":11},{"$f":"IF(ISERROR(VLOOKUP(DATE($E$315,$B$314,N326),Holiday,2,FALSE)),\"\",VLOOKUP(DATE($E$315,$B$314,N326),Holiday,2,FALSE))","v":""}]
[]
[null,{"$f":"IF(設定!$C$10=\"\",\"\",設定!$C$10)","v":"パパ"},null,{"$f":"IF(設定!$C$10=\"\",\"\",設定!$C$10)","v":"パパ"},null,{"$f":"IF(設定!$C$10=\"\",\"\",設定!$C$10)","v":"パパ"},null,{"$f":"IF(設定!$C$10=\"\",\"\",設定!$C$10)","v":"パパ"},null,{"$f":"IF(設定!$C$10=\"\",\"\",設定!$C$10)","v":"パパ"},null,{"$f":"IF(設定!$C$10=\"\",\"\",設定!$C$10)","v":"パパ"},null,{"$f":"IF(設定!$C$10=\"\",\"\",設定!$C$10)","v":"パパ"}]
[null,{"$f":"IF(設定!$C$11=\"\",\"\",設定!$C$11)","v":"ママ"},null,{"$f":"IF(設定!$C$11=\"\",\"\",設定!$C$11)","v":"ママ"},null,{"$f":"IF(設定!$C$11=\"\",\"\",設定!$C$11)","v":"ママ"},null,{"$f":"IF(設定!$C$11=\"\",\"\",設定!$C$11)","v":"ママ"},null,{"$f":"IF(設定!$C$11=\"\",\"\",設定!$C$11)","v":"ママ"},null,{"$f":"IF(設定!$C$11=\"\",\"\",設定!$C$11)","v":"ママ"},null,{"$f":"IF(設定!$C$11=\"\",\"\",設定!$C$11)","v":"ママ"}]
[null,{"$f":"IF(設定!$C$12=\"\",\"\",設定!$C$12)","v":"さとる"},null,{"$f":"IF(設定!$C$12=\"\",\"\",設定!$C$12)","v":"さとる"},null,{"$f":"IF(設定!$C$12=\"\",\"\",設定!$C$12)","v":"さとる"},null,{"$f":"IF(設定!$C$12=\"\",\"\",設定!$C$12)","v":"さとる"},null,{"$f":"IF(設定!$C$12=\"\",\"\",設定!$C$12)","v":"さとる"},null,{"$f":"IF(設定!$C$12=\"\",\"\",設定!$C$12)","v":"さとる"},null,{"$f":"IF(設定!$C$12=\"\",\"\",設定!$C$12)","v":"さとる"}]
[null,{"$f":"IF(設定!$C$13=\"\",\"\",設定!$C$13)","v":"くるみ"},null,{"$f":"IF(設定!$C$13=\"\",\"\",設定!$C$13)","v":"くるみ"},null,{"$f":"IF(設定!$C$13=\"\",\"\",設定!$C$13)","v":"くるみ"},null,{"$f":"IF(設定!$C$13=\"\",\"\",設定!$C$13)","v":"くるみ"},null,{"$f":"IF(設定!$C$13=\"\",\"\",設定!$C$13)","v":"くるみ"},null,{"$f":"IF(設定!$C$13=\"\",\"\",設定!$C$13)","v":"くるみ"},null,{"$f":"IF(設定!$C$13=\"\",\"\",設定!$C$13)","v":"くるみ"}]
[null,{"$f":"IF(設定!$C$14=\"\",\"\",設定!$C$14)","v":"ともか"},null,{"$f":"IF(設定!$C$14=\"\",\"\",設定!$C$14)","v":"ともか"},null,{"$f":"IF(設定!$C$14=\"\",\"\",設定!$C$14)","v":"ともか"},null,{"$f":"IF(設定!$C$14=\"\",\"\",設定!$C$14)","v":"ともか"},null,{"$f":"IF(設定!$C$14=\"\",\"\",設定!$C$14)","v":"ともか"},null,{"$f":"IF(設定!$C$14=\"\",\"\",設定!$C$14)","v":"ともか"},null,{"$f":"IF(設定!$C$14=\"\",\"\",設定!$C$14)","v":"ともか"}]
[null,{"$f":"$B$5","v":"月"},null,{"$f":"$D$5","v":"火"},null,{"$f":"$F$5","v":"水"},null,{"$f":"$H$5","v":"木"},null,{"$f":"$J$5","v":"金"},null,{"$f":"$L$5","v":"土"},null,{"$f":"$N$5","v":"日"}]
[null,{"$f":"$N326+1","v":12},{"$f":"IF(ISERROR(VLOOKUP(DATE($E$315,$B$314,B334),Holiday,2,FALSE)),\"\",VLOOKUP(DATE($E$315,$B$314,B334),Holiday,2,FALSE))","v":""},{"$f":"B334+1","v":13},{"$f":"IF(ISERROR(VLOOKUP(DATE($E$315,$B$314,D334),Holiday,2,FALSE)),\"\",VLOOKUP(DATE($E$315,$B$314,D334),Holiday,2,FALSE))","v":""},{"$f":"D334+1","v":14},{"$f":"IF(ISERROR(VLOOKUP(DATE($E$315,$B$314,F334),Holiday,2,FALSE)),\"\",VLOOKUP(DATE($E$315,$B$314,F334),Holiday,2,FALSE))","v":""},{"$f":"F334+1","v":15},{"$f":"IF(ISERROR(VLOOKUP(DATE($E$315,$B$314,H334),Holiday,2,FALSE)),\"\",VLOOKUP(DATE($E$315,$B$314,H334),Holiday,2,FALSE))","v":""},{"$f":"H334+1","v":16},{"$f":"IF(ISERROR(VLOOKUP(DATE($E$315,$B$314,J334),Holiday,2,FALSE)),\"\",VLOOKUP(DATE($E$315,$B$314,J334),Holiday,2,FALSE))","v":""},{"$f":"J334+1","v":17},{"$f":"IF(ISERROR(VLOOKUP(DATE($E$315,$B$314,L334),Holiday,2,FALSE)),\"\",VLOOKUP(DATE($E$315,$B$314,L334),Holiday,2,FALSE))","v":""},{"$f":"L334+1","v":18},{"$f":"IF(ISERROR(VLOOKUP(DATE($E$315,$B$314,N334),Holiday,2,FALSE)),\"\",VLOOKUP(DATE($E$315,$B$314,N334),Holiday,2,FALSE))","v":""}]
[]
[null,{"$f":"IF(設定!$C$10=\"\",\"\",設定!$C$10)","v":"パパ"},null,{"$f":"IF(設定!$C$10=\"\",\"\",設定!$C$10)","v":"パパ"},null,{"$f":"IF(設定!$C$10=\"\",\"\",設定!$C$10)","v":"パパ"},null,{"$f":"IF(設定!$C$10=\"\",\"\",設定!$C$10)","v":"パパ"},null,{"$f":"IF(設定!$C$10=\"\",\"\",設定!$C$10)","v":"パパ"},null,{"$f":"IF(設定!$C$10=\"\",\"\",設定!$C$10)","v":"パパ"},null,{"$f":"IF(設定!$C$10=\"\",\"\",設定!$C$10)","v":"パパ"}]
[null,{"$f":"IF(設定!$C$11=\"\",\"\",設定!$C$11)","v":"ママ"},null,{"$f":"IF(設定!$C$11=\"\",\"\",設定!$C$11)","v":"ママ"},null,{"$f":"IF(設定!$C$11=\"\",\"\",設定!$C$11)","v":"ママ"},null,{"$f":"IF(設定!$C$11=\"\",\"\",設定!$C$11)","v":"ママ"},null,{"$f":"IF(設定!$C$11=\"\",\"\",設定!$C$11)","v":"ママ"},null,{"$f":"IF(設定!$C$11=\"\",\"\",設定!$C$11)","v":"ママ"},null,{"$f":"IF(設定!$C$11=\"\",\"\",設定!$C$11)","v":"ママ"}]
[null,{"$f":"IF(設定!$C$12=\"\",\"\",設定!$C$12)","v":"さとる"},null,{"$f":"IF(設定!$C$12=\"\",\"\",設定!$C$12)","v":"さとる"},null,{"$f":"IF(設定!$C$12=\"\",\"\",設定!$C$12)","v":"さとる"},null,{"$f":"IF(設定!$C$12=\"\",\"\",設定!$C$12)","v":"さとる"},null,{"$f":"IF(設定!$C$12=\"\",\"\",設定!$C$12)","v":"さとる"},null,{"$f":"IF(設定!$C$12=\"\",\"\",設定!$C$12)","v":"さとる"},null,{"$f":"IF(設定!$C$12=\"\",\"\",設定!$C$12)","v":"さとる"}]
[null,{"$f":"IF(設定!$C$13=\"\",\"\",設定!$C$13)","v":"くるみ"},null,{"$f":"IF(設定!$C$13=\"\",\"\",設定!$C$13)","v":"くるみ"},null,{"$f":"IF(設定!$C$13=\"\",\"\",設定!$C$13)","v":"くるみ"},null,{"$f":"IF(設定!$C$13=\"\",\"\",設定!$C$13)","v":"くるみ"},null,{"$f":"IF(設定!$C$13=\"\",\"\",設定!$C$13)","v":"くるみ"},null,{"$f":"IF(設定!$C$13=\"\",\"\",設定!$C$13)","v":"くるみ"},null,{"$f":"IF(設定!$C$13=\"\",\"\",設定!$C$13)","v":"くるみ"}]
[null,{"$f":"IF(設定!$C$14=\"\",\"\",設定!$C$14)","v":"ともか"},null,{"$f":"IF(設定!$C$14=\"\",\"\",設定!$C$14)","v":"ともか"},null,{"$f":"IF(設定!$C$14=\"\",\"\",設定!$C$14)","v":"ともか"},null,{"$f":"IF(設定!$C$14=\"\",\"\",設定!$C$14)","v":"ともか"},null,{"$f":"IF(設定!$C$14=\"\",\"\",設定!$C$14)","v":"ともか"},null,{"$f":"IF(設定!$C$14=\"\",\"\",設定!$C$14)","v":"ともか"},null,{"$f":"IF(設定!$C$14=\"\",\"\",設定!$C$14)","v":"ともか"}]
[null,{"$f":"$B$5","v":"月"},null,{"$f":"$D$5","v":"火"},null,{"$f":"$F$5","v":"水"},null,{"$f":"$H$5","v":"木"},null,{"$f":"$J$5","v":"金"},null,{"$f":"$L$5","v":"土"},null,{"$f":"$N$5","v":"日"}]
[null,{"$f":"$N334+1","v":19},{"$f":"IF(ISERROR(VLOOKUP(DATE($E$315,$B$314,B342),Holiday,2,FALSE)),\"\",VLOOKUP(DATE($E$315,$B$314,B342),Holiday,2,FALSE))","v":"海の日"},{"$f":"B342+1","v":20},{"$f":"IF(ISERROR(VLOOKUP(DATE($E$315,$B$314,D342),Holiday,2,FALSE)),\"\",VLOOKUP(DATE($E$315,$B$314,D342),Holiday,2,FALSE))","v":""},{"$f":"D342+1","v":21},{"$f":"IF(ISERROR(VLOOKUP(DATE($E$315,$B$314,F342),Holiday,2,FALSE)),\"\",VLOOKUP(DATE($E$315,$B$314,F342),Holiday,2,FALSE))","v":""},{"$f":"F342+1","v":22},{"$f":"IF(ISERROR(VLOOKUP(DATE($E$315,$B$314,H342),Holiday,2,FALSE)),\"\",VLOOKUP(DATE($E$315,$B$314,H342),Holiday,2,FALSE))","v":""},{"$f":"H342+1","v":23},{"$f":"IF(ISERROR(VLOOKUP(DATE($E$315,$B$314,J342),Holiday,2,FALSE)),\"\",VLOOKUP(DATE($E$315,$B$314,J342),Holiday,2,FALSE))","v":""},{"$f":"J342+1","v":24},{"$f":"IF(ISERROR(VLOOKUP(DATE($E$315,$B$314,L342),Holiday,2,FALSE)),\"\",VLOOKUP(DATE($E$315,$B$314,L342),Holiday,2,FALSE))","v":""},{"$f":"L342+1","v":25},{"$f":"IF(ISERROR(VLOOKUP(DATE($E$315,$B$314,N342),Holiday,2,FALSE)),\"\",VLOOKUP(DATE($E$315,$B$314,N342),Holiday,2,FALSE))","v":""}]
[]
[null,{"$f":"IF(設定!$C$10=\"\",\"\",設定!$C$10)","v":"パパ"},null,{"$f":"IF(設定!$C$10=\"\",\"\",設定!$C$10)","v":"パパ"},null,{"$f":"IF(設定!$C$10=\"\",\"\",設定!$C$10)","v":"パパ"},null,{"$f":"IF(設定!$C$10=\"\",\"\",設定!$C$10)","v":"パパ"},null,{"$f":"IF(設定!$C$10=\"\",\"\",設定!$C$10)","v":"パパ"},null,{"$f":"IF(設定!$C$10=\"\",\"\",設定!$C$10)","v":"パパ"},null,{"$f":"IF(設定!$C$10=\"\",\"\",設定!$C$10)","v":"パパ"}]
[null,{"$f":"IF(設定!$C$11=\"\",\"\",設定!$C$11)","v":"ママ"},null,{"$f":"IF(設定!$C$11=\"\",\"\",設定!$C$11)","v":"ママ"},null,{"$f":"IF(設定!$C$11=\"\",\"\",設定!$C$11)","v":"ママ"},null,{"$f":"IF(設定!$C$11=\"\",\"\",設定!$C$11)","v":"ママ"},null,{"$f":"IF(設定!$C$11=\"\",\"\",設定!$C$11)","v":"ママ"},null,{"$f":"IF(設定!$C$11=\"\",\"\",設定!$C$11)","v":"ママ"},null,{"$f":"IF(設定!$C$11=\"\",\"\",設定!$C$11)","v":"ママ"}]
[null,{"$f":"IF(設定!$C$12=\"\",\"\",設定!$C$12)","v":"さとる"},null,{"$f":"IF(設定!$C$12=\"\",\"\",設定!$C$12)","v":"さとる"},null,{"$f":"IF(設定!$C$12=\"\",\"\",設定!$C$12)","v":"さとる"},null,{"$f":"IF(設定!$C$12=\"\",\"\",設定!$C$12)","v":"さとる"},null,{"$f":"IF(設定!$C$12=\"\",\"\",設定!$C$12)","v":"さとる"},null,{"$f":"IF(設定!$C$12=\"\",\"\",設定!$C$12)","v":"さとる"},null,{"$f":"IF(設定!$C$12=\"\",\"\",設定!$C$12)","v":"さとる"}]
[null,{"$f":"IF(設定!$C$13=\"\",\"\",設定!$C$13)","v":"くるみ"},null,{"$f":"IF(設定!$C$13=\"\",\"\",設定!$C$13)","v":"くるみ"},null,{"$f":"IF(設定!$C$13=\"\",\"\",設定!$C$13)","v":"くるみ"},null,{"$f":"IF(設定!$C$13=\"\",\"\",設定!$C$13)","v":"くるみ"},null,{"$f":"IF(設定!$C$13=\"\",\"\",設定!$C$13)","v":"くるみ"},null,{"$f":"IF(設定!$C$13=\"\",\"\",設定!$C$13)","v":"くるみ"},null,{"$f":"IF(設定!$C$13=\"\",\"\",設定!$C$13)","v":"くるみ"}]
[null,{"$f":"IF(設定!$C$14=\"\",\"\",設定!$C$14)","v":"ともか"},null,{"$f":"IF(設定!$C$14=\"\",\"\",設定!$C$14)","v":"ともか"},null,{"$f":"IF(設定!$C$14=\"\",\"\",設定!$C$14)","v":"ともか"},null,{"$f":"IF(設定!$C$14=\"\",\"\",設定!$C$14)","v":"ともか"},null,{"$f":"IF(設定!$C$14=\"\",\"\",設定!$C$14)","v":"ともか"},null,{"$f":"IF(設定!$C$14=\"\",\"\",設定!$C$14)","v":"ともか"},null,{"$f":"IF(設定!$C$14=\"\",\"\",設定!$C$14)","v":"ともか"}]
[null,{"$f":"$B$5","v":"月"},null,{"$f":"$D$5","v":"火"},null,{"$f":"$F$5","v":"水"},null,{"$f":"$H$5","v":"木"},null,{"$f":"$J$5","v":"金"},null,{"$f":"$L$5","v":"土"},null,{"$f":"$N$5","v":"日"}]
[null,{"$f":"$N342+1","v":26},{"$f":"IF(ISERROR(VLOOKUP(DATE($E$315,$B$314,B350),Holiday,2,FALSE)),\"\",VLOOKUP(DATE($E$315,$B$314,B350),Holiday,2,FALSE))","v":""},{"$f":"B350+1","v":27},{"$f":"IF(ISERROR(VLOOKUP(DATE($E$315,$B$314,D350),Holiday,2,FALSE)),\"\",VLOOKUP(DATE($E$315,$B$314,D350),Holiday,2,FALSE))","v":""},{"$f":"D350+1","v":28},{"$f":"IF(ISERROR(VLOOKUP(DATE($E$315,$B$314,F350),Holiday,2,FALSE)),\"\",VLOOKUP(DATE($E$315,$B$314,F350),Holiday,2,FALSE))","v":""},{"$f":"F350+1","v":29},{"$f":"IF(ISERROR(VLOOKUP(DATE($E$315,$B$314,H350),Holiday,2,FALSE)),\"\",VLOOKUP(DATE($E$315,$B$314,H350),Holiday,2,FALSE))","v":""},{"$f":"H350+1","v":30},{"$f":"IF(ISERROR(VLOOKUP(DATE($E$315,$B$314,J350),Holiday,2,FALSE)),\"\",VLOOKUP(DATE($E$315,$B$314,J350),Holiday,2,FALSE))","v":""},{"$f":"J350+1","v":31},{"$f":"IF(ISERROR(VLOOKUP(DATE($E$315,$B$314,L350),Holiday,2,FALSE)),\"\",VLOOKUP(DATE($E$315,$B$314,L350),Holiday,2,FALSE))","v":""},{"$f":"L350+1","v":32},{"$f":"IF(ISERROR(VLOOKUP(DATE($E$315,$B$314,N350),Holiday,2,FALSE)),\"\",VLOOKUP(DATE($E$315,$B$314,N350),Holiday,2,FALSE))","v":""}]
[]
[null,{"$f":"IF(設定!$C$10=\"\",\"\",設定!$C$10)","v":"パパ"},null,{"$f":"IF(設定!$C$10=\"\",\"\",設定!$C$10)","v":"パパ"},null,{"$f":"IF(設定!$C$10=\"\",\"\",設定!$C$10)","v":"パパ"},null,{"$f":"IF(設定!$C$10=\"\",\"\",設定!$C$10)","v":"パパ"},null,{"$f":"IF(設定!$C$10=\"\",\"\",設定!$C$10)","v":"パパ"},null,{"$f":"IF(設定!$C$10=\"\",\"\",設定!$C$10)","v":"パパ"},null,{"$f":"IF(設定!$C$10=\"\",\"\",設定!$C$10)","v":"パパ"}]
[null,{"$f":"IF(設定!$C$11=\"\",\"\",設定!$C$11)","v":"ママ"},null,{"$f":"IF(設定!$C$11=\"\",\"\",設定!$C$11)","v":"ママ"},null,{"$f":"IF(設定!$C$11=\"\",\"\",設定!$C$11)","v":"ママ"},null,{"$f":"IF(設定!$C$11=\"\",\"\",設定!$C$11)","v":"ママ"},null,{"$f":"IF(設定!$C$11=\"\",\"\",設定!$C$11)","v":"ママ"},null,{"$f":"IF(設定!$C$11=\"\",\"\",設定!$C$11)","v":"ママ"},null,{"$f":"IF(設定!$C$11=\"\",\"\",設定!$C$11)","v":"ママ"}]
[null,{"$f":"IF(設定!$C$12=\"\",\"\",設定!$C$12)","v":"さとる"},null,{"$f":"IF(設定!$C$12=\"\",\"\",設定!$C$12)","v":"さとる"},null,{"$f":"IF(設定!$C$12=\"\",\"\",設定!$C$12)","v":"さとる"},null,{"$f":"IF(設定!$C$12=\"\",\"\",設定!$C$12)","v":"さとる"},null,{"$f":"IF(設定!$C$12=\"\",\"\",設定!$C$12)","v":"さとる"},null,{"$f":"IF(設定!$C$12=\"\",\"\",設定!$C$12)","v":"さとる"},null,{"$f":"IF(設定!$C$12=\"\",\"\",設定!$C$12)","v":"さとる"}]
[null,{"$f":"IF(設定!$C$13=\"\",\"\",設定!$C$13)","v":"くるみ"},null,{"$f":"IF(設定!$C$13=\"\",\"\",設定!$C$13)","v":"くるみ"},null,{"$f":"IF(設定!$C$13=\"\",\"\",設定!$C$13)","v":"くるみ"},null,{"$f":"IF(設定!$C$13=\"\",\"\",設定!$C$13)","v":"くるみ"},null,{"$f":"IF(設定!$C$13=\"\",\"\",設定!$C$13)","v":"くるみ"},null,{"$f":"IF(設定!$C$13=\"\",\"\",設定!$C$13)","v":"くるみ"},null,{"$f":"IF(設定!$C$13=\"\",\"\",設定!$C$13)","v":"くるみ"}]
[null,{"$f":"IF(設定!$C$14=\"\",\"\",設定!$C$14)","v":"ともか"},null,{"$f":"IF(設定!$C$14=\"\",\"\",設定!$C$14)","v":"ともか"},null,{"$f":"IF(設定!$C$14=\"\",\"\",設定!$C$14)","v":"ともか"},null,{"$f":"IF(設定!$C$14=\"\",\"\",設定!$C$14)","v":"ともか"},null,{"$f":"IF(設定!$C$14=\"\",\"\",設定!$C$14)","v":"ともか"},null,{"$f":"IF(設定!$C$14=\"\",\"\",設定!$C$14)","v":"ともか"},null,{"$f":"IF(設定!$C$14=\"\",\"\",設定!$C$14)","v":"ともか"}]
[null,{"$f":"$B$5","v":"月"},null,{"$f":"$D$5","v":"火"},null,{"$f":"$F$5","v":"水"},null,{"$f":"$H$5","v":"木"},null,{"$f":"$J$5","v":"金"},null,{"$f":"$L$5","v":"土"},null,{"$f":"$N$5","v":"日"}]
[null,{"$f":"$N350+1","v":33},{"$f":"IF(ISERROR(VLOOKUP(DATE($E$315,$B$314,B358),Holiday,2,FALSE)),\"\",VLOOKUP(DATE($E$315,$B$314,B358),Holiday,2,FALSE))","v":""},{"$f":"B358+1","v":34},{"$f":"IF(ISERROR(VLOOKUP(DATE($E$315,$B$314,D358),Holiday,2,FALSE)),\"\",VLOOKUP(DATE($E$315,$B$314,D358),Holiday,2,FALSE))","v":""},{"$f":"D358+1","v":35},{"$f":"IF(ISERROR(VLOOKUP(DATE($E$315,$B$314,F358),Holiday,2,FALSE)),\"\",VLOOKUP(DATE($E$315,$B$314,F358),Holiday,2,FALSE))","v":""},{"$f":"F358+1","v":36},{"$f":"IF(ISERROR(VLOOKUP(DATE($E$315,$B$314,H358),Holiday,2,FALSE)),\"\",VLOOKUP(DATE($E$315,$B$314,H358),Holiday,2,FALSE))","v":""},{"$f":"H358+1","v":37},{"$f":"IF(ISERROR(VLOOKUP(DATE($E$315,$B$314,J358),Holiday,2,FALSE)),\"\",VLOOKUP(DATE($E$315,$B$314,J358),Holiday,2,FALSE))","v":""},{"$f":"J358+1","v":38},{"$f":"IF(ISERROR(VLOOKUP(DATE($E$315,$B$314,L358),Holiday,2,FALSE)),\"\",VLOOKUP(DATE($E$315,$B$314,L358),Holiday,2,FALSE))","v":""},{"$f":"L358+1","v":39},{"$f":"IF(ISERROR(VLOOKUP(DATE($E$315,$B$314,N358),Holiday,2,FALSE)),\"\",VLOOKUP(DATE($E$315,$B$314,N358),Holiday,2,FALSE))","v":""}]
[]
[null,{"$f":"IF(設定!$C$10=\"\",\"\",設定!$C$10)","v":"パパ"},null,{"$f":"IF(設定!$C$10=\"\",\"\",設定!$C$10)","v":"パパ"},null,{"$f":"IF(設定!$C$10=\"\",\"\",設定!$C$10)","v":"パパ"},null,{"$f":"IF(設定!$C$10=\"\",\"\",設定!$C$10)","v":"パパ"},null,{"$f":"IF(設定!$C$10=\"\",\"\",設定!$C$10)","v":"パパ"},null,{"$f":"IF(設定!$C$10=\"\",\"\",設定!$C$10)","v":"パパ"},null,{"$f":"IF(設定!$C$10=\"\",\"\",設定!$C$10)","v":"パパ"}]
[null,{"$f":"IF(設定!$C$11=\"\",\"\",設定!$C$11)","v":"ママ"},null,{"$f":"IF(設定!$C$11=\"\",\"\",設定!$C$11)","v":"ママ"},null,{"$f":"IF(設定!$C$11=\"\",\"\",設定!$C$11)","v":"ママ"},null,{"$f":"IF(設定!$C$11=\"\",\"\",設定!$C$11)","v":"ママ"},null,{"$f":"IF(設定!$C$11=\"\",\"\",設定!$C$11)","v":"ママ"},null,{"$f":"IF(設定!$C$11=\"\",\"\",設定!$C$11)","v":"ママ"},null,{"$f":"IF(設定!$C$11=\"\",\"\",設定!$C$11)","v":"ママ"}]
[null,{"$f":"IF(設定!$C$12=\"\",\"\",設定!$C$12)","v":"さとる"},null,{"$f":"IF(設定!$C$12=\"\",\"\",設定!$C$12)","v":"さとる"},null,{"$f":"IF(設定!$C$12=\"\",\"\",設定!$C$12)","v":"さとる"},null,{"$f":"IF(設定!$C$12=\"\",\"\",設定!$C$12)","v":"さとる"},null,{"$f":"IF(設定!$C$12=\"\",\"\",設定!$C$12)","v":"さとる"},null,{"$f":"IF(設定!$C$12=\"\",\"\",設定!$C$12)","v":"さとる"},null,{"$f":"IF(設定!$C$12=\"\",\"\",設定!$C$12)","v":"さとる"}]
[null,{"$f":"IF(設定!$C$13=\"\",\"\",設定!$C$13)","v":"くるみ"},null,{"$f":"IF(設定!$C$13=\"\",\"\",設定!$C$13)","v":"くるみ"},null,{"$f":"IF(設定!$C$13=\"\",\"\",設定!$C$13)","v":"くるみ"},null,{"$f":"IF(設定!$C$13=\"\",\"\",設定!$C$13)","v":"くるみ"},null,{"$f":"IF(設定!$C$13=\"\",\"\",設定!$C$13)","v":"くるみ"},null,{"$f":"IF(設定!$C$13=\"\",\"\",設定!$C$13)","v":"くるみ"},null,{"$f":"IF(設定!$C$13=\"\",\"\",設定!$C$13)","v":"くるみ"}]
[null,{"$f":"IF(設定!$C$14=\"\",\"\",設定!$C$14)","v":"ともか"},null,{"$f":"IF(設定!$C$14=\"\",\"\",設定!$C$14)","v":"ともか"},null,{"$f":"IF(設定!$C$14=\"\",\"\",設定!$C$14)","v":"ともか"},null,{"$f":"IF(設定!$C$14=\"\",\"\",設定!$C$14)","v":"ともか"},null,{"$f":"IF(設定!$C$14=\"\",\"\",設定!$C$14)","v":"ともか"},null,{"$f":"IF(設定!$C$14=\"\",\"\",設定!$C$14)","v":"ともか"},null,{"$f":"IF(設定!$C$14=\"\",\"\",設定!$C$14)","v":"ともか"}]
[2013]
[null,{"$f":"IF(B314+1>12,1,B314+1)","v":8}]
[null,{"$f":"CHOOSE($B366,\"January\",\"February\",\"March\",\"April\",\"May\",\"June\",\"July\",\"August\",\"September\",\"October\",\"November\",\"December\")","v":"August"},null,null,{"$f":"IF(B366=1,E315+1,E315)","v":2021}]
[]
[null,{"$f":"$B$5","v":"月"},null,{"$f":"$D$5","v":"火"},null,{"$f":"$F$5","v":"水"},null,{"$f":"$H$5","v":"木"},null,{"$f":"$J$5","v":"金"},null,{"$f":"$L$5","v":"土"},null,{"$f":"$N$5","v":"日"}]
[null,{"$f":"IF(IF(B369=\"日\",1,2)>=WEEKDAY(DATE($E367,$B366,1)),IF(IF(B369=\"日\",1,2)-WEEKDAY(DATE($E367,$B366,1))+1>1,\"\",IF(B369=\"日\",1,2)-WEEKDAY(DATE($E367,$B366,1))+1),\"\")","v":""},{"$f":"IF(ISERROR(VLOOKUP(DATE($E$367,$B$366,B370),Holiday,2,FALSE)),\"\",VLOOKUP(DATE($E$367,$B$366,B370),Holiday,2,FALSE))","v":""},{"$f":"IF(IF(D369=\"月\",2,3)>=WEEKDAY(DATE($E367,$B366,1)),IF(IF(D369=\"月\",2,3)-WEEKDAY(DATE($E367,$B366,1))+1>2,\"\",IF(D369=\"月\",2,3)-WEEKDAY(DATE($E367,$B366,1))+1),\"\")","v":""},{"$f":"IF(ISERROR(VLOOKUP(DATE($E$367,$B$366,D370),Holiday,2,FALSE)),\"\",VLOOKUP(DATE($E$367,$B$366,D370),Holiday,2,FALSE))","v":""},{"$f":"IF(IF(F369=\"火\",3,4)>=WEEKDAY(DATE($E367,$B366,1)),IF(IF(F369=\"火\",3,4)-WEEKDAY(DATE($E367,$B366,1))+1>3,\"\",IF(F369=\"火\",3,4)-WEEKDAY(DATE($E367,$B366,1))+1),\"\")","v":""},{"$f":"IF(ISERROR(VLOOKUP(DATE($E$367,$B$366,F370),Holiday,2,FALSE)),\"\",VLOOKUP(DATE($E$367,$B$366,F370),Holiday,2,FALSE))","v":""},{"$f":"IF(IF(H369=\"水\",4,5)>=WEEKDAY(DATE($E367,$B366,1)),IF(IF(H369=\"水\",4,5)-WEEKDAY(DATE($E367,$B366,1))+1>4,\"\",IF(H369=\"水\",4,5)-WEEKDAY(DATE($E367,$B366,1))+1),\"\")","v":""},{"$f":"IF(ISERROR(VLOOKUP(DATE($E$367,$B$366,H370),Holiday,2,FALSE)),\"\",VLOOKUP(DATE($E$367,$B$366,H370),Holiday,2,FALSE))","v":""},{"$f":"IF(IF(J369=\"木\",5,6)>=WEEKDAY(DATE($E367,$B366,1)),IF(IF(J369=\"木\",5,6)-WEEKDAY(DATE($E367,$B366,1))+1>5,\"\",IF(J369=\"木\",5,6)-WEEKDAY(DATE($E367,$B366,1))+1),\"\")","v":""},{"$f":"IF(ISERROR(VLOOKUP(DATE($E$367,$B$366,J370),Holiday,2,FALSE)),\"\",VLOOKUP(DATE($E$367,$B$366,J370),Holiday,2,FALSE))","v":""},{"$f":"IF(IF(L369=\"金\",6,7)>=WEEKDAY(DATE($E367,$B366,1)),IF(IF(L369=\"金\",6,7)-WEEKDAY(DATE($E367,$B366,1))+1>6,\"\",IF(L369=\"金\",6,7)-WEEKDAY(DATE($E367,$B366,1))+1),\"\")","v":""},{"$f":"IF(ISERROR(VLOOKUP(DATE($E$367,$B$366,L370),Holiday,2,FALSE)),\"\",VLOOKUP(DATE($E$367,$B$366,L370),Holiday,2,FALSE))","v":""},{"$f":"IF(L370=\"\",IF(IF(N369=\"土\",7,1)>=WEEKDAY(DATE($E367,$B366,1)),IF(N369=\"土\",7,1)-WEEKDAY(DATE($E367,$B366,1))+1),L370+1)","v":1},{"$f":"IF(ISERROR(VLOOKUP(DATE($E$367,$B$366,N370),Holiday,2,FALSE)),\"\",VLOOKUP(DATE($E$367,$B$366,N370),Holiday,2,FALSE))","v":""}]
[]
[null,{"$f":"IF(設定!$C$10=\"\",\"\",設定!$C$10)","v":"パパ"},null,{"$f":"IF(設定!$C$10=\"\",\"\",設定!$C$10)","v":"パパ"},null,{"$f":"IF(設定!$C$10=\"\",\"\",設定!$C$10)","v":"パパ"},null,{"$f":"IF(設定!$C$10=\"\",\"\",設定!$C$10)","v":"パパ"},null,{"$f":"IF(設定!$C$10=\"\",\"\",設定!$C$10)","v":"パパ"},null,{"$f":"IF(設定!$C$10=\"\",\"\",設定!$C$10)","v":"パパ"},null,{"$f":"IF(設定!$C$10=\"\",\"\",設定!$C$10)","v":"パパ"}]
[null,{"$f":"IF(設定!$C$11=\"\",\"\",設定!$C$11)","v":"ママ"},null,{"$f":"IF(設定!$C$11=\"\",\"\",設定!$C$11)","v":"ママ"},null,{"$f":"IF(設定!$C$11=\"\",\"\",設定!$C$11)","v":"ママ"},null,{"$f":"IF(設定!$C$11=\"\",\"\",設定!$C$11)","v":"ママ"},null,{"$f":"IF(設定!$C$11=\"\",\"\",設定!$C$11)","v":"ママ"},null,{"$f":"IF(設定!$C$11=\"\",\"\",設定!$C$11)","v":"ママ"},null,{"$f":"IF(設定!$C$11=\"\",\"\",設定!$C$11)","v":"ママ"}]
[null,{"$f":"IF(設定!$C$12=\"\",\"\",設定!$C$12)","v":"さとる"},null,{"$f":"IF(設定!$C$12=\"\",\"\",設定!$C$12)","v":"さとる"},null,{"$f":"IF(設定!$C$12=\"\",\"\",設定!$C$12)","v":"さとる"},null,{"$f":"IF(設定!$C$12=\"\",\"\",設定!$C$12)","v":"さとる"},null,{"$f":"IF(設定!$C$12=\"\",\"\",設定!$C$12)","v":"さとる"},null,{"$f":"IF(設定!$C$12=\"\",\"\",設定!$C$12)","v":"さとる"},null,{"$f":"IF(設定!$C$12=\"\",\"\",設定!$C$12)","v":"さとる"}]
[null,{"$f":"IF(設定!$C$13=\"\",\"\",設定!$C$13)","v":"くるみ"},null,{"$f":"IF(設定!$C$13=\"\",\"\",設定!$C$13)","v":"くるみ"},null,{"$f":"IF(設定!$C$13=\"\",\"\",設定!$C$13)","v":"くるみ"},null,{"$f":"IF(設定!$C$13=\"\",\"\",設定!$C$13)","v":"くるみ"},null,{"$f":"IF(設定!$C$13=\"\",\"\",設定!$C$13)","v":"くるみ"},null,{"$f":"IF(設定!$C$13=\"\",\"\",設定!$C$13)","v":"くるみ"},null,{"$f":"IF(設定!$C$13=\"\",\"\",設定!$C$13)","v":"くるみ"}]
[null,{"$f":"IF(設定!$C$14=\"\",\"\",設定!$C$14)","v":"ともか"},null,{"$f":"IF(設定!$C$14=\"\",\"\",設定!$C$14)","v":"ともか"},null,{"$f":"IF(設定!$C$14=\"\",\"\",設定!$C$14)","v":"ともか"},null,{"$f":"IF(設定!$C$14=\"\",\"\",設定!$C$14)","v":"ともか"},null,{"$f":"IF(設定!$C$14=\"\",\"\",設定!$C$14)","v":"ともか"},null,{"$f":"IF(設定!$C$14=\"\",\"\",設定!$C$14)","v":"ともか"},null,{"$f":"IF(設定!$C$14=\"\",\"\",設定!$C$14)","v":"ともか"}]
[null,{"$f":"$B$5","v":"月"},null,{"$f":"$D$5","v":"火"},null,{"$f":"$F$5","v":"水"},null,{"$f":"$H$5","v":"木"},null,{"$f":"$J$5","v":"金"},null,{"$f":"$L$5","v":"土"},null,{"$f":"$N$5","v":"日"}]
[null,{"$f":"$N370+1","v":2},{"$f":"IF(ISERROR(VLOOKUP(DATE($E$367,$B$366,B378),Holiday,2,FALSE)),\"\",VLOOKUP(DATE($E$367,$B$366,B378),Holiday,2,FALSE))","v":""},{"$f":"B378+1","v":3},{"$f":"IF(ISERROR(VLOOKUP(DATE($E$367,$B$366,D378),Holiday,2,FALSE)),\"\",VLOOKUP(DATE($E$367,$B$366,D378),Holiday,2,FALSE))","v":""},{"$f":"D378+1","v":4},{"$f":"IF(ISERROR(VLOOKUP(DATE($E$367,$B$366,F378),Holiday,2,FALSE)),\"\",VLOOKUP(DATE($E$367,$B$366,F378),Holiday,2,FALSE))","v":""},{"$f":"F378+1","v":5},{"$f":"IF(ISERROR(VLOOKUP(DATE($E$367,$B$366,H378),Holiday,2,FALSE)),\"\",VLOOKUP(DATE($E$367,$B$366,H378),Holiday,2,FALSE))","v":""},{"$f":"H378+1","v":6},{"$f":"IF(ISERROR(VLOOKUP(DATE($E$367,$B$366,J378),Holiday,2,FALSE)),\"\",VLOOKUP(DATE($E$367,$B$366,J378),Holiday,2,FALSE))","v":""},{"$f":"J378+1","v":7},{"$f":"IF(ISERROR(VLOOKUP(DATE($E$367,$B$366,L378),Holiday,2,FALSE)),\"\",VLOOKUP(DATE($E$367,$B$366,L378),Holiday,2,FALSE))","v":""},{"$f":"L378+1","v":8},{"$f":"IF(ISERROR(VLOOKUP(DATE($E$367,$B$366,N378),Holiday,2,FALSE)),\"\",VLOOKUP(DATE($E$367,$B$366,N378),Holiday,2,FALSE))","v":""}]
[]
[null,{"$f":"IF(設定!$C$10=\"\",\"\",設定!$C$10)","v":"パパ"},null,{"$f":"IF(設定!$C$10=\"\",\"\",設定!$C$10)","v":"パパ"},null,{"$f":"IF(設定!$C$10=\"\",\"\",設定!$C$10)","v":"パパ"},null,{"$f":"IF(設定!$C$10=\"\",\"\",設定!$C$10)","v":"パパ"},null,{"$f":"IF(設定!$C$10=\"\",\"\",設定!$C$10)","v":"パパ"},null,{"$f":"IF(設定!$C$10=\"\",\"\",設定!$C$10)","v":"パパ"},null,{"$f":"IF(設定!$C$10=\"\",\"\",設定!$C$10)","v":"パパ"}]
[null,{"$f":"IF(設定!$C$11=\"\",\"\",設定!$C$11)","v":"ママ"},null,{"$f":"IF(設定!$C$11=\"\",\"\",設定!$C$11)","v":"ママ"},null,{"$f":"IF(設定!$C$11=\"\",\"\",設定!$C$11)","v":"ママ"},null,{"$f":"IF(設定!$C$11=\"\",\"\",設定!$C$11)","v":"ママ"},null,{"$f":"IF(設定!$C$11=\"\",\"\",設定!$C$11)","v":"ママ"},null,{"$f":"IF(設定!$C$11=\"\",\"\",設定!$C$11)","v":"ママ"},null,{"$f":"IF(設定!$C$11=\"\",\"\",設定!$C$11)","v":"ママ"}]
[null,{"$f":"IF(設定!$C$12=\"\",\"\",設定!$C$12)","v":"さとる"},null,{"$f":"IF(設定!$C$12=\"\",\"\",設定!$C$12)","v":"さとる"},null,{"$f":"IF(設定!$C$12=\"\",\"\",設定!$C$12)","v":"さとる"},null,{"$f":"IF(設定!$C$12=\"\",\"\",設定!$C$12)","v":"さとる"},null,{"$f":"IF(設定!$C$12=\"\",\"\",設定!$C$12)","v":"さとる"},null,{"$f":"IF(設定!$C$12=\"\",\"\",設定!$C$12)","v":"さとる"},null,{"$f":"IF(設定!$C$12=\"\",\"\",設定!$C$12)","v":"さとる"}]
[null,{"$f":"IF(設定!$C$13=\"\",\"\",設定!$C$13)","v":"くるみ"},null,{"$f":"IF(設定!$C$13=\"\",\"\",設定!$C$13)","v":"くるみ"},null,{"$f":"IF(設定!$C$13=\"\",\"\",設定!$C$13)","v":"くるみ"},null,{"$f":"IF(設定!$C$13=\"\",\"\",設定!$C$13)","v":"くるみ"},null,{"$f":"IF(設定!$C$13=\"\",\"\",設定!$C$13)","v":"くるみ"},null,{"$f":"IF(設定!$C$13=\"\",\"\",設定!$C$13)","v":"くるみ"},null,{"$f":"IF(設定!$C$13=\"\",\"\",設定!$C$13)","v":"くるみ"}]
[null,{"$f":"IF(設定!$C$14=\"\",\"\",設定!$C$14)","v":"ともか"},null,{"$f":"IF(設定!$C$14=\"\",\"\",設定!$C$14)","v":"ともか"},null,{"$f":"IF(設定!$C$14=\"\",\"\",設定!$C$14)","v":"ともか"},null,{"$f":"IF(設定!$C$14=\"\",\"\",設定!$C$14)","v":"ともか"},null,{"$f":"IF(設定!$C$14=\"\",\"\",設定!$C$14)","v":"ともか"},null,{"$f":"IF(設定!$C$14=\"\",\"\",設定!$C$14)","v":"ともか"},null,{"$f":"IF(設定!$C$14=\"\",\"\",設定!$C$14)","v":"ともか"}]
[null,{"$f":"$B$5","v":"月"},null,{"$f":"$D$5","v":"火"},null,{"$f":"$F$5","v":"水"},null,{"$f":"$H$5","v":"木"},null,{"$f":"$J$5","v":"金"},null,{"$f":"$L$5","v":"土"},null,{"$f":"$N$5","v":"日"}]
[null,{"$f":"$N378+1","v":9},{"$f":"IF(ISERROR(VLOOKUP(DATE($E$367,$B$366,B386),Holiday,2,FALSE)),\"\",VLOOKUP(DATE($E$367,$B$366,B386),Holiday,2,FALSE))","v":""},{"$f":"B386+1","v":10},{"$f":"IF(ISERROR(VLOOKUP(DATE($E$367,$B$366,D386),Holiday,2,FALSE)),\"\",VLOOKUP(DATE($E$367,$B$366,D386),Holiday,2,FALSE))","v":""},{"$f":"D386+1","v":11},{"$f":"IF(ISERROR(VLOOKUP(DATE($E$367,$B$366,F386),Holiday,2,FALSE)),\"\",VLOOKUP(DATE($E$367,$B$366,F386),Holiday,2,FALSE))","v":""},{"$f":"F386+1","v":12},{"$f":"IF(ISERROR(VLOOKUP(DATE($E$367,$B$366,H386),Holiday,2,FALSE)),\"\",VLOOKUP(DATE($E$367,$B$366,H386),Holiday,2,FALSE))","v":""},{"$f":"H386+1","v":13},{"$f":"IF(ISERROR(VLOOKUP(DATE($E$367,$B$366,J386),Holiday,2,FALSE)),\"\",VLOOKUP(DATE($E$367,$B$366,J386),Holiday,2,FALSE))","v":""},{"$f":"J386+1","v":14},{"$f":"IF(ISERROR(VLOOKUP(DATE($E$367,$B$366,L386),Holiday,2,FALSE)),\"\",VLOOKUP(DATE($E$367,$B$366,L386),Holiday,2,FALSE))","v":""},{"$f":"L386+1","v":15},{"$f":"IF(ISERROR(VLOOKUP(DATE($E$367,$B$366,N386),Holiday,2,FALSE)),\"\",VLOOKUP(DATE($E$367,$B$366,N386),Holiday,2,FALSE))","v":""}]
[]
[null,{"$f":"IF(設定!$C$10=\"\",\"\",設定!$C$10)","v":"パパ"},null,{"$f":"IF(設定!$C$10=\"\",\"\",設定!$C$10)","v":"パパ"},null,{"$f":"IF(設定!$C$10=\"\",\"\",設定!$C$10)","v":"パパ"},null,{"$f":"IF(設定!$C$10=\"\",\"\",設定!$C$10)","v":"パパ"},null,{"$f":"IF(設定!$C$10=\"\",\"\",設定!$C$10)","v":"パパ"},null,{"$f":"IF(設定!$C$10=\"\",\"\",設定!$C$10)","v":"パパ"},null,{"$f":"IF(設定!$C$10=\"\",\"\",設定!$C$10)","v":"パパ"}]
[null,{"$f":"IF(設定!$C$11=\"\",\"\",設定!$C$11)","v":"ママ"},null,{"$f":"IF(設定!$C$11=\"\",\"\",設定!$C$11)","v":"ママ"},null,{"$f":"IF(設定!$C$11=\"\",\"\",設定!$C$11)","v":"ママ"},null,{"$f":"IF(設定!$C$11=\"\",\"\",設定!$C$11)","v":"ママ"},null,{"$f":"IF(設定!$C$11=\"\",\"\",設定!$C$11)","v":"ママ"},null,{"$f":"IF(設定!$C$11=\"\",\"\",設定!$C$11)","v":"ママ"},null,{"$f":"IF(設定!$C$11=\"\",\"\",設定!$C$11)","v":"ママ"}]
[null,{"$f":"IF(設定!$C$12=\"\",\"\",設定!$C$12)","v":"さとる"},null,{"$f":"IF(設定!$C$12=\"\",\"\",設定!$C$12)","v":"さとる"},null,{"$f":"IF(設定!$C$12=\"\",\"\",設定!$C$12)","v":"さとる"},null,{"$f":"IF(設定!$C$12=\"\",\"\",設定!$C$12)","v":"さとる"},null,{"$f":"IF(設定!$C$12=\"\",\"\",設定!$C$12)","v":"さとる"},null,{"$f":"IF(設定!$C$12=\"\",\"\",設定!$C$12)","v":"さとる"},null,{"$f":"IF(設定!$C$12=\"\",\"\",設定!$C$12)","v":"さとる"}]
[null,{"$f":"IF(設定!$C$13=\"\",\"\",設定!$C$13)","v":"くるみ"},null,{"$f":"IF(設定!$C$13=\"\",\"\",設定!$C$13)","v":"くるみ"},null,{"$f":"IF(設定!$C$13=\"\",\"\",設定!$C$13)","v":"くるみ"},null,{"$f":"IF(設定!$C$13=\"\",\"\",設定!$C$13)","v":"くるみ"},null,{"$f":"IF(設定!$C$13=\"\",\"\",設定!$C$13)","v":"くるみ"},null,{"$f":"IF(設定!$C$13=\"\",\"\",設定!$C$13)","v":"くるみ"},null,{"$f":"IF(設定!$C$13=\"\",\"\",設定!$C$13)","v":"くるみ"}]
[null,{"$f":"IF(設定!$C$14=\"\",\"\",設定!$C$14)","v":"ともか"},null,{"$f":"IF(設定!$C$14=\"\",\"\",設定!$C$14)","v":"ともか"},null,{"$f":"IF(設定!$C$14=\"\",\"\",設定!$C$14)","v":"ともか"},null,{"$f":"IF(設定!$C$14=\"\",\"\",設定!$C$14)","v":"ともか"},null,{"$f":"IF(設定!$C$14=\"\",\"\",設定!$C$14)","v":"ともか"},null,{"$f":"IF(設定!$C$14=\"\",\"\",設定!$C$14)","v":"ともか"},null,{"$f":"IF(設定!$C$14=\"\",\"\",設定!$C$14)","v":"ともか"}]
[null,{"$f":"$B$5","v":"月"},null,{"$f":"$D$5","v":"火"},null,{"$f":"$F$5","v":"水"},null,{"$f":"$H$5","v":"木"},null,{"$f":"$J$5","v":"金"},null,{"$f":"$L$5","v":"土"},null,{"$f":"$N$5","v":"日"}]
[null,{"$f":"$N386+1","v":16},{"$f":"IF(ISERROR(VLOOKUP(DATE($E$367,$B$366,B394),Holiday,2,FALSE)),\"\",VLOOKUP(DATE($E$367,$B$366,B394),Holiday,2,FALSE))","v":""},{"$f":"B394+1","v":17},{"$f":"IF(ISERROR(VLOOKUP(DATE($E$367,$B$366,D394),Holiday,2,FALSE)),\"\",VLOOKUP(DATE($E$367,$B$366,D394),Holiday,2,FALSE))","v":""},{"$f":"D394+1","v":18},{"$f":"IF(ISERROR(VLOOKUP(DATE($E$367,$B$366,F394),Holiday,2,FALSE)),\"\",VLOOKUP(DATE($E$367,$B$366,F394),Holiday,2,FALSE))","v":""},{"$f":"F394+1","v":19},{"$f":"IF(ISERROR(VLOOKUP(DATE($E$367,$B$366,H394),Holiday,2,FALSE)),\"\",VLOOKUP(DATE($E$367,$B$366,H394),Holiday,2,FALSE))","v":""},{"$f":"H394+1","v":20},{"$f":"IF(ISERROR(VLOOKUP(DATE($E$367,$B$366,J394),Holiday,2,FALSE)),\"\",VLOOKUP(DATE($E$367,$B$366,J394),Holiday,2,FALSE))","v":""},{"$f":"J394+1","v":21},{"$f":"IF(ISERROR(VLOOKUP(DATE($E$367,$B$366,L394),Holiday,2,FALSE)),\"\",VLOOKUP(DATE($E$367,$B$366,L394),Holiday,2,FALSE))","v":""},{"$f":"L394+1","v":22},{"$f":"IF(ISERROR(VLOOKUP(DATE($E$367,$B$366,N394),Holiday,2,FALSE)),\"\",VLOOKUP(DATE($E$367,$B$366,N394),Holiday,2,FALSE))","v":""}]
[]
[null,{"$f":"IF(設定!$C$10=\"\",\"\",設定!$C$10)","v":"パパ"},null,{"$f":"IF(設定!$C$10=\"\",\"\",設定!$C$10)","v":"パパ"},null,{"$f":"IF(設定!$C$10=\"\",\"\",設定!$C$10)","v":"パパ"},null,{"$f":"IF(設定!$C$10=\"\",\"\",設定!$C$10)","v":"パパ"},null,{"$f":"IF(設定!$C$10=\"\",\"\",設定!$C$10)","v":"パパ"},null,{"$f":"IF(設定!$C$10=\"\",\"\",設定!$C$10)","v":"パパ"},null,{"$f":"IF(設定!$C$10=\"\",\"\",設定!$C$10)","v":"パパ"}]
[null,{"$f":"IF(設定!$C$11=\"\",\"\",設定!$C$11)","v":"ママ"},null,{"$f":"IF(設定!$C$11=\"\",\"\",設定!$C$11)","v":"ママ"},null,{"$f":"IF(設定!$C$11=\"\",\"\",設定!$C$11)","v":"ママ"},null,{"$f":"IF(設定!$C$11=\"\",\"\",設定!$C$11)","v":"ママ"},null,{"$f":"IF(設定!$C$11=\"\",\"\",設定!$C$11)","v":"ママ"},null,{"$f":"IF(設定!$C$11=\"\",\"\",設定!$C$11)","v":"ママ"},null,{"$f":"IF(設定!$C$11=\"\",\"\",設定!$C$11)","v":"ママ"}]
[null,{"$f":"IF(設定!$C$12=\"\",\"\",設定!$C$12)","v":"さとる"},null,{"$f":"IF(設定!$C$12=\"\",\"\",設定!$C$12)","v":"さとる"},null,{"$f":"IF(設定!$C$12=\"\",\"\",設定!$C$12)","v":"さとる"},null,{"$f":"IF(設定!$C$12=\"\",\"\",設定!$C$12)","v":"さとる"},null,{"$f":"IF(設定!$C$12=\"\",\"\",設定!$C$12)","v":"さとる"},null,{"$f":"IF(設定!$C$12=\"\",\"\",設定!$C$12)","v":"さとる"},null,{"$f":"IF(設定!$C$12=\"\",\"\",設定!$C$12)","v":"さとる"}]
[null,{"$f":"IF(設定!$C$13=\"\",\"\",設定!$C$13)","v":"くるみ"},null,{"$f":"IF(設定!$C$13=\"\",\"\",設定!$C$13)","v":"くるみ"},null,{"$f":"IF(設定!$C$13=\"\",\"\",設定!$C$13)","v":"くるみ"},null,{"$f":"IF(設定!$C$13=\"\",\"\",設定!$C$13)","v":"くるみ"},null,{"$f":"IF(設定!$C$13=\"\",\"\",設定!$C$13)","v":"くるみ"},null,{"$f":"IF(設定!$C$13=\"\",\"\",設定!$C$13)","v":"くるみ"},null,{"$f":"IF(設定!$C$13=\"\",\"\",設定!$C$13)","v":"くるみ"}]
[null,{"$f":"IF(設定!$C$14=\"\",\"\",設定!$C$14)","v":"ともか"},null,{"$f":"IF(設定!$C$14=\"\",\"\",設定!$C$14)","v":"ともか"},null,{"$f":"IF(設定!$C$14=\"\",\"\",設定!$C$14)","v":"ともか"},null,{"$f":"IF(設定!$C$14=\"\",\"\",設定!$C$14)","v":"ともか"},null,{"$f":"IF(設定!$C$14=\"\",\"\",設定!$C$14)","v":"ともか"},null,{"$f":"IF(設定!$C$14=\"\",\"\",設定!$C$14)","v":"ともか"},null,{"$f":"IF(設定!$C$14=\"\",\"\",設定!$C$14)","v":"ともか"}]
[null,{"$f":"$B$5","v":"月"},null,{"$f":"$D$5","v":"火"},null,{"$f":"$F$5","v":"水"},null,{"$f":"$H$5","v":"木"},null,{"$f":"$J$5","v":"金"},null,{"$f":"$L$5","v":"土"},null,{"$f":"$N$5","v":"日"}]
[null,{"$f":"$N394+1","v":23},{"$f":"IF(ISERROR(VLOOKUP(DATE($E$367,$B$366,B402),Holiday,2,FALSE)),\"\",VLOOKUP(DATE($E$367,$B$366,B402),Holiday,2,FALSE))","v":""},{"$f":"B402+1","v":24},{"$f":"IF(ISERROR(VLOOKUP(DATE($E$367,$B$366,D402),Holiday,2,FALSE)),\"\",VLOOKUP(DATE($E$367,$B$366,D402),Holiday,2,FALSE))","v":""},{"$f":"D402+1","v":25},{"$f":"IF(ISERROR(VLOOKUP(DATE($E$367,$B$366,F402),Holiday,2,FALSE)),\"\",VLOOKUP(DATE($E$367,$B$366,F402),Holiday,2,FALSE))","v":""},{"$f":"F402+1","v":26},{"$f":"IF(ISERROR(VLOOKUP(DATE($E$367,$B$366,H402),Holiday,2,FALSE)),\"\",VLOOKUP(DATE($E$367,$B$366,H402),Holiday,2,FALSE))","v":""},{"$f":"H402+1","v":27},{"$f":"IF(ISERROR(VLOOKUP(DATE($E$367,$B$366,J402),Holiday,2,FALSE)),\"\",VLOOKUP(DATE($E$367,$B$366,J402),Holiday,2,FALSE))","v":""},{"$f":"J402+1","v":28},{"$f":"IF(ISERROR(VLOOKUP(DATE($E$367,$B$366,L402),Holiday,2,FALSE)),\"\",VLOOKUP(DATE($E$367,$B$366,L402),Holiday,2,FALSE))","v":""},{"$f":"L402+1","v":29},{"$f":"IF(ISERROR(VLOOKUP(DATE($E$367,$B$366,N402),Holiday,2,FALSE)),\"\",VLOOKUP(DATE($E$367,$B$366,N402),Holiday,2,FALSE))","v":""}]
[]
[null,{"$f":"IF(設定!$C$10=\"\",\"\",設定!$C$10)","v":"パパ"},null,{"$f":"IF(設定!$C$10=\"\",\"\",設定!$C$10)","v":"パパ"},null,{"$f":"IF(設定!$C$10=\"\",\"\",設定!$C$10)","v":"パパ"},null,{"$f":"IF(設定!$C$10=\"\",\"\",設定!$C$10)","v":"パパ"},null,{"$f":"IF(設定!$C$10=\"\",\"\",設定!$C$10)","v":"パパ"},null,{"$f":"IF(設定!$C$10=\"\",\"\",設定!$C$10)","v":"パパ"},null,{"$f":"IF(設定!$C$10=\"\",\"\",設定!$C$10)","v":"パパ"}]
[null,{"$f":"IF(設定!$C$11=\"\",\"\",設定!$C$11)","v":"ママ"},null,{"$f":"IF(設定!$C$11=\"\",\"\",設定!$C$11)","v":"ママ"},null,{"$f":"IF(設定!$C$11=\"\",\"\",設定!$C$11)","v":"ママ"},null,{"$f":"IF(設定!$C$11=\"\",\"\",設定!$C$11)","v":"ママ"},null,{"$f":"IF(設定!$C$11=\"\",\"\",設定!$C$11)","v":"ママ"},null,{"$f":"IF(設定!$C$11=\"\",\"\",設定!$C$11)","v":"ママ"},null,{"$f":"IF(設定!$C$11=\"\",\"\",設定!$C$11)","v":"ママ"}]
[null,{"$f":"IF(設定!$C$12=\"\",\"\",設定!$C$12)","v":"さとる"},null,{"$f":"IF(設定!$C$12=\"\",\"\",設定!$C$12)","v":"さとる"},null,{"$f":"IF(設定!$C$12=\"\",\"\",設定!$C$12)","v":"さとる"},null,{"$f":"IF(設定!$C$12=\"\",\"\",設定!$C$12)","v":"さとる"},null,{"$f":"IF(設定!$C$12=\"\",\"\",設定!$C$12)","v":"さとる"},null,{"$f":"IF(設定!$C$12=\"\",\"\",設定!$C$12)","v":"さとる"},null,{"$f":"IF(設定!$C$12=\"\",\"\",設定!$C$12)","v":"さとる"}]
[null,{"$f":"IF(設定!$C$13=\"\",\"\",設定!$C$13)","v":"くるみ"},null,{"$f":"IF(設定!$C$13=\"\",\"\",設定!$C$13)","v":"くるみ"},null,{"$f":"IF(設定!$C$13=\"\",\"\",設定!$C$13)","v":"くるみ"},null,{"$f":"IF(設定!$C$13=\"\",\"\",設定!$C$13)","v":"くるみ"},null,{"$f":"IF(設定!$C$13=\"\",\"\",設定!$C$13)","v":"くるみ"},null,{"$f":"IF(設定!$C$13=\"\",\"\",設定!$C$13)","v":"くるみ"},null,{"$f":"IF(設定!$C$13=\"\",\"\",設定!$C$13)","v":"くるみ"}]
[null,{"$f":"IF(設定!$C$14=\"\",\"\",設定!$C$14)","v":"ともか"},null,{"$f":"IF(設定!$C$14=\"\",\"\",設定!$C$14)","v":"ともか"},null,{"$f":"IF(設定!$C$14=\"\",\"\",設定!$C$14)","v":"ともか"},null,{"$f":"IF(設定!$C$14=\"\",\"\",設定!$C$14)","v":"ともか"},null,{"$f":"IF(設定!$C$14=\"\",\"\",設定!$C$14)","v":"ともか"},null,{"$f":"IF(設定!$C$14=\"\",\"\",設定!$C$14)","v":"ともか"},null,{"$f":"IF(設定!$C$14=\"\",\"\",設定!$C$14)","v":"ともか"}]
[null,{"$f":"$B$5","v":"月"},null,{"$f":"$D$5","v":"火"},null,{"$f":"$F$5","v":"水"},null,{"$f":"$H$5","v":"木"},null,{"$f":"$J$5","v":"金"},null,{"$f":"$L$5","v":"土"},null,{"$f":"$N$5","v":"日"}]
[null,{"$f":"$N402+1","v":30},{"$f":"IF(ISERROR(VLOOKUP(DATE($E$367,$B$366,B410),Holiday,2,FALSE)),\"\",VLOOKUP(DATE($E$367,$B$366,B410),Holiday,2,FALSE))","v":""},{"$f":"B410+1","v":31},{"$f":"IF(ISERROR(VLOOKUP(DATE($E$367,$B$366,D410),Holiday,2,FALSE)),\"\",VLOOKUP(DATE($E$367,$B$366,D410),Holiday,2,FALSE))","v":""},{"$f":"D410+1","v":32},{"$f":"IF(ISERROR(VLOOKUP(DATE($E$367,$B$366,F410),Holiday,2,FALSE)),\"\",VLOOKUP(DATE($E$367,$B$366,F410),Holiday,2,FALSE))","v":""},{"$f":"F410+1","v":33},{"$f":"IF(ISERROR(VLOOKUP(DATE($E$367,$B$366,H410),Holiday,2,FALSE)),\"\",VLOOKUP(DATE($E$367,$B$366,H410),Holiday,2,FALSE))","v":""},{"$f":"H410+1","v":34},{"$f":"IF(ISERROR(VLOOKUP(DATE($E$367,$B$366,J410),Holiday,2,FALSE)),\"\",VLOOKUP(DATE($E$367,$B$366,J410),Holiday,2,FALSE))","v":""},{"$f":"J410+1","v":35},{"$f":"IF(ISERROR(VLOOKUP(DATE($E$367,$B$366,L410),Holiday,2,FALSE)),\"\",VLOOKUP(DATE($E$367,$B$366,L410),Holiday,2,FALSE))","v":""},{"$f":"L410+1","v":36},{"$f":"IF(ISERROR(VLOOKUP(DATE($E$367,$B$366,N410),Holiday,2,FALSE)),\"\",VLOOKUP(DATE($E$367,$B$366,N410),Holiday,2,FALSE))","v":""}]
[]
[null,{"$f":"IF(設定!$C$10=\"\",\"\",設定!$C$10)","v":"パパ"},null,{"$f":"IF(設定!$C$10=\"\",\"\",設定!$C$10)","v":"パパ"},null,{"$f":"IF(設定!$C$10=\"\",\"\",設定!$C$10)","v":"パパ"},null,{"$f":"IF(設定!$C$10=\"\",\"\",設定!$C$10)","v":"パパ"},null,{"$f":"IF(設定!$C$10=\"\",\"\",設定!$C$10)","v":"パパ"},null,{"$f":"IF(設定!$C$10=\"\",\"\",設定!$C$10)","v":"パパ"},null,{"$f":"IF(設定!$C$10=\"\",\"\",設定!$C$10)","v":"パパ"}]
[null,{"$f":"IF(設定!$C$11=\"\",\"\",設定!$C$11)","v":"ママ"},null,{"$f":"IF(設定!$C$11=\"\",\"\",設定!$C$11)","v":"ママ"},null,{"$f":"IF(設定!$C$11=\"\",\"\",設定!$C$11)","v":"ママ"},null,{"$f":"IF(設定!$C$11=\"\",\"\",設定!$C$11)","v":"ママ"},null,{"$f":"IF(設定!$C$11=\"\",\"\",設定!$C$11)","v":"ママ"},null,{"$f":"IF(設定!$C$11=\"\",\"\",設定!$C$11)","v":"ママ"},null,{"$f":"IF(設定!$C$11=\"\",\"\",設定!$C$11)","v":"ママ"}]
[null,{"$f":"IF(設定!$C$12=\"\",\"\",設定!$C$12)","v":"さとる"},null,{"$f":"IF(設定!$C$12=\"\",\"\",設定!$C$12)","v":"さとる"},null,{"$f":"IF(設定!$C$12=\"\",\"\",設定!$C$12)","v":"さとる"},null,{"$f":"IF(設定!$C$12=\"\",\"\",設定!$C$12)","v":"さとる"},null,{"$f":"IF(設定!$C$12=\"\",\"\",設定!$C$12)","v":"さとる"},null,{"$f":"IF(設定!$C$12=\"\",\"\",設定!$C$12)","v":"さとる"},null,{"$f":"IF(設定!$C$12=\"\",\"\",設定!$C$12)","v":"さとる"}]
[null,{"$f":"IF(設定!$C$13=\"\",\"\",設定!$C$13)","v":"くるみ"},null,{"$f":"IF(設定!$C$13=\"\",\"\",設定!$C$13)","v":"くるみ"},null,{"$f":"IF(設定!$C$13=\"\",\"\",設定!$C$13)","v":"くるみ"},null,{"$f":"IF(設定!$C$13=\"\",\"\",設定!$C$13)","v":"くるみ"},null,{"$f":"IF(設定!$C$13=\"\",\"\",設定!$C$13)","v":"くるみ"},null,{"$f":"IF(設定!$C$13=\"\",\"\",設定!$C$13)","v":"くるみ"},null,{"$f":"IF(設定!$C$13=\"\",\"\",設定!$C$13)","v":"くるみ"}]
[null,{"$f":"IF(設定!$C$14=\"\",\"\",設定!$C$14)","v":"ともか"},null,{"$f":"IF(設定!$C$14=\"\",\"\",設定!$C$14)","v":"ともか"},null,{"$f":"IF(設定!$C$14=\"\",\"\",設定!$C$14)","v":"ともか"},null,{"$f":"IF(設定!$C$14=\"\",\"\",設定!$C$14)","v":"ともか"},null,{"$f":"IF(設定!$C$14=\"\",\"\",設定!$C$14)","v":"ともか"},null,{"$f":"IF(設定!$C$14=\"\",\"\",設定!$C$14)","v":"ともか"},null,{"$f":"IF(設定!$C$14=\"\",\"\",設定!$C$14)","v":"ともか"}]
[2013]
[null,{"$f":"IF(B366+1>12,1,B366+1)","v":9}]
[null,{"$f":"CHOOSE($B418,\"January\",\"February\",\"March\",\"April\",\"May\",\"June\",\"July\",\"August\",\"September\",\"October\",\"November\",\"December\")","v":"September"},null,null,{"$f":"IF(B418=1,E367+1,E367)","v":2021}]
[]
[null,{"$f":"$B$5","v":"月"},null,{"$f":"$D$5","v":"火"},null,{"$f":"$F$5","v":"水"},null,{"$f":"$H$5","v":"木"},null,{"$f":"$J$5","v":"金"},null,{"$f":"$L$5","v":"土"},null,{"$f":"$N$5","v":"日"}]
[null,{"$f":"IF(IF(B421=\"日\",1,2)>=WEEKDAY(DATE($E419,$B418,1)),IF(IF(B421=\"日\",1,2)-WEEKDAY(DATE($E419,$B418,1))+1>1,\"\",IF(B421=\"日\",1,2)-WEEKDAY(DATE($E419,$B418,1))+1),\"\")","v":""},{"$f":"IF(ISERROR(VLOOKUP(DATE($E$419,$B$418,B422),Holiday,2,FALSE)),\"\",VLOOKUP(DATE($E$419,$B$418,B422),Holiday,2,FALSE))","v":""},{"$f":"IF(IF(D421=\"月\",2,3)>=WEEKDAY(DATE($E419,$B418,1)),IF(IF(D421=\"月\",2,3)-WEEKDAY(DATE($E419,$B418,1))+1>2,\"\",IF(D421=\"月\",2,3)-WEEKDAY(DATE($E419,$B418,1))+1),\"\")","v":""},{"$f":"IF(ISERROR(VLOOKUP(DATE($E$419,$B$418,D422),Holiday,2,FALSE)),\"\",VLOOKUP(DATE($E$419,$B$418,D422),Holiday,2,FALSE))","v":""},{"$f":"IF(IF(F421=\"火\",3,4)>=WEEKDAY(DATE($E419,$B418,1)),IF(IF(F421=\"火\",3,4)-WEEKDAY(DATE($E419,$B418,1))+1>3,\"\",IF(F421=\"火\",3,4)-WEEKDAY(DATE($E419,$B418,1))+1),\"\")","v":1},{"$f":"IF(ISERROR(VLOOKUP(DATE($E$419,$B$418,F422),Holiday,2,FALSE)),\"\",VLOOKUP(DATE($E$419,$B$418,F422),Holiday,2,FALSE))","v":""},{"$f":"IF(IF(H421=\"水\",4,5)>=WEEKDAY(DATE($E419,$B418,1)),IF(IF(H421=\"水\",4,5)-WEEKDAY(DATE($E419,$B418,1))+1>4,\"\",IF(H421=\"水\",4,5)-WEEKDAY(DATE($E419,$B418,1))+1),\"\")","v":2},{"$f":"IF(ISERROR(VLOOKUP(DATE($E$419,$B$418,H422),Holiday,2,FALSE)),\"\",VLOOKUP(DATE($E$419,$B$418,H422),Holiday,2,FALSE))","v":""},{"$f":"IF(IF(J421=\"木\",5,6)>=WEEKDAY(DATE($E419,$B418,1)),IF(IF(J421=\"木\",5,6)-WEEKDAY(DATE($E419,$B418,1))+1>5,\"\",IF(J421=\"木\",5,6)-WEEKDAY(DATE($E419,$B418,1))+1),\"\")","v":3},{"$f":"IF(ISERROR(VLOOKUP(DATE($E$419,$B$418,J422),Holiday,2,FALSE)),\"\",VLOOKUP(DATE($E$419,$B$418,J422),Holiday,2,FALSE))","v":""},{"$f":"IF(IF(L421=\"金\",6,7)>=WEEKDAY(DATE($E419,$B418,1)),IF(IF(L421=\"金\",6,7)-WEEKDAY(DATE($E419,$B418,1))+1>6,\"\",IF(L421=\"金\",6,7)-WEEKDAY(DATE($E419,$B418,1))+1),\"\")","v":4},{"$f":"IF(ISERROR(VLOOKUP(DATE($E$419,$B$418,L422),Holiday,2,FALSE)),\"\",VLOOKUP(DATE($E$419,$B$418,L422),Holiday,2,FALSE))","v":""},{"$f":"IF(L422=\"\",IF(IF(N421=\"土\",7,1)>=WEEKDAY(DATE($E419,$B418,1)),IF(N421=\"土\",7,1)-WEEKDAY(DATE($E419,$B418,1))+1),L422+1)","v":5},{"$f":"IF(ISERROR(VLOOKUP(DATE($E$419,$B$418,N422),Holiday,2,FALSE)),\"\",VLOOKUP(DATE($E$419,$B$418,N422),Holiday,2,FALSE))","v":""}]
[]
[null,{"$f":"IF(設定!$C$10=\"\",\"\",設定!$C$10)","v":"パパ"},null,{"$f":"IF(設定!$C$10=\"\",\"\",設定!$C$10)","v":"パパ"},null,{"$f":"IF(設定!$C$10=\"\",\"\",設定!$C$10)","v":"パパ"},null,{"$f":"IF(設定!$C$10=\"\",\"\",設定!$C$10)","v":"パパ"},null,{"$f":"IF(設定!$C$10=\"\",\"\",設定!$C$10)","v":"パパ"},null,{"$f":"IF(設定!$C$10=\"\",\"\",設定!$C$10)","v":"パパ"},null,{"$f":"IF(設定!$C$10=\"\",\"\",設定!$C$10)","v":"パパ"}]
[null,{"$f":"IF(設定!$C$11=\"\",\"\",設定!$C$11)","v":"ママ"},null,{"$f":"IF(設定!$C$11=\"\",\"\",設定!$C$11)","v":"ママ"},null,{"$f":"IF(設定!$C$11=\"\",\"\",設定!$C$11)","v":"ママ"},null,{"$f":"IF(設定!$C$11=\"\",\"\",設定!$C$11)","v":"ママ"},null,{"$f":"IF(設定!$C$11=\"\",\"\",設定!$C$11)","v":"ママ"},null,{"$f":"IF(設定!$C$11=\"\",\"\",設定!$C$11)","v":"ママ"},null,{"$f":"IF(設定!$C$11=\"\",\"\",設定!$C$11)","v":"ママ"}]
[null,{"$f":"IF(設定!$C$12=\"\",\"\",設定!$C$12)","v":"さとる"},null,{"$f":"IF(設定!$C$12=\"\",\"\",設定!$C$12)","v":"さとる"},null,{"$f":"IF(設定!$C$12=\"\",\"\",設定!$C$12)","v":"さとる"},null,{"$f":"IF(設定!$C$12=\"\",\"\",設定!$C$12)","v":"さとる"},null,{"$f":"IF(設定!$C$12=\"\",\"\",設定!$C$12)","v":"さとる"},null,{"$f":"IF(設定!$C$12=\"\",\"\",設定!$C$12)","v":"さとる"},null,{"$f":"IF(設定!$C$12=\"\",\"\",設定!$C$12)","v":"さとる"}]
[null,{"$f":"IF(設定!$C$13=\"\",\"\",設定!$C$13)","v":"くるみ"},null,{"$f":"IF(設定!$C$13=\"\",\"\",設定!$C$13)","v":"くるみ"},null,{"$f":"IF(設定!$C$13=\"\",\"\",設定!$C$13)","v":"くるみ"},null,{"$f":"IF(設定!$C$13=\"\",\"\",設定!$C$13)","v":"くるみ"},null,{"$f":"IF(設定!$C$13=\"\",\"\",設定!$C$13)","v":"くるみ"},null,{"$f":"IF(設定!$C$13=\"\",\"\",設定!$C$13)","v":"くるみ"},null,{"$f":"IF(設定!$C$13=\"\",\"\",設定!$C$13)","v":"くるみ"}]
[null,{"$f":"IF(設定!$C$14=\"\",\"\",設定!$C$14)","v":"ともか"},null,{"$f":"IF(設定!$C$14=\"\",\"\",設定!$C$14)","v":"ともか"},null,{"$f":"IF(設定!$C$14=\"\",\"\",設定!$C$14)","v":"ともか"},null,{"$f":"IF(設定!$C$14=\"\",\"\",設定!$C$14)","v":"ともか"},null,{"$f":"IF(設定!$C$14=\"\",\"\",設定!$C$14)","v":"ともか"},null,{"$f":"IF(設定!$C$14=\"\",\"\",設定!$C$14)","v":"ともか"},null,{"$f":"IF(設定!$C$14=\"\",\"\",設定!$C$14)","v":"ともか"}]
[null,{"$f":"$B$5","v":"月"},null,{"$f":"$D$5","v":"火"},null,{"$f":"$F$5","v":"水"},null,{"$f":"$H$5","v":"木"},null,{"$f":"$J$5","v":"金"},null,{"$f":"$L$5","v":"土"},null,{"$f":"$N$5","v":"日"}]
[null,{"$f":"$N422+1","v":6},{"$f":"IF(ISERROR(VLOOKUP(DATE($E$419,$B$418,B430),Holiday,2,FALSE)),\"\",VLOOKUP(DATE($E$419,$B$418,B430),Holiday,2,FALSE))","v":""},{"$f":"B430+1","v":7},{"$f":"IF(ISERROR(VLOOKUP(DATE($E$419,$B$418,D430),Holiday,2,FALSE)),\"\",VLOOKUP(DATE($E$419,$B$418,D430),Holiday,2,FALSE))","v":""},{"$f":"D430+1","v":8},{"$f":"IF(ISERROR(VLOOKUP(DATE($E$419,$B$418,F430),Holiday,2,FALSE)),\"\",VLOOKUP(DATE($E$419,$B$418,F430),Holiday,2,FALSE))","v":""},{"$f":"F430+1","v":9},{"$f":"IF(ISERROR(VLOOKUP(DATE($E$419,$B$418,H430),Holiday,2,FALSE)),\"\",VLOOKUP(DATE($E$419,$B$418,H430),Holiday,2,FALSE))","v":""},{"$f":"H430+1","v":10},{"$f":"IF(ISERROR(VLOOKUP(DATE($E$419,$B$418,J430),Holiday,2,FALSE)),\"\",VLOOKUP(DATE($E$419,$B$418,J430),Holiday,2,FALSE))","v":""},{"$f":"J430+1","v":11},{"$f":"IF(ISERROR(VLOOKUP(DATE($E$419,$B$418,L430),Holiday,2,FALSE)),\"\",VLOOKUP(DATE($E$419,$B$418,L430),Holiday,2,FALSE))","v":""},{"$f":"L430+1","v":12},{"$f":"IF(ISERROR(VLOOKUP(DATE($E$419,$B$418,N430),Holiday,2,FALSE)),\"\",VLOOKUP(DATE($E$419,$B$418,N430),Holiday,2,FALSE))","v":""}]
[]
[null,{"$f":"IF(設定!$C$10=\"\",\"\",設定!$C$10)","v":"パパ"},null,{"$f":"IF(設定!$C$10=\"\",\"\",設定!$C$10)","v":"パパ"},null,{"$f":"IF(設定!$C$10=\"\",\"\",設定!$C$10)","v":"パパ"},null,{"$f":"IF(設定!$C$10=\"\",\"\",設定!$C$10)","v":"パパ"},null,{"$f":"IF(設定!$C$10=\"\",\"\",設定!$C$10)","v":"パパ"},null,{"$f":"IF(設定!$C$10=\"\",\"\",設定!$C$10)","v":"パパ"},null,{"$f":"IF(設定!$C$10=\"\",\"\",設定!$C$10)","v":"パパ"}]
[null,{"$f":"IF(設定!$C$11=\"\",\"\",設定!$C$11)","v":"ママ"},null,{"$f":"IF(設定!$C$11=\"\",\"\",設定!$C$11)","v":"ママ"},null,{"$f":"IF(設定!$C$11=\"\",\"\",設定!$C$11)","v":"ママ"},null,{"$f":"IF(設定!$C$11=\"\",\"\",設定!$C$11)","v":"ママ"},null,{"$f":"IF(設定!$C$11=\"\",\"\",設定!$C$11)","v":"ママ"},null,{"$f":"IF(設定!$C$11=\"\",\"\",設定!$C$11)","v":"ママ"},null,{"$f":"IF(設定!$C$11=\"\",\"\",設定!$C$11)","v":"ママ"}]
[null,{"$f":"IF(設定!$C$12=\"\",\"\",設定!$C$12)","v":"さとる"},null,{"$f":"IF(設定!$C$12=\"\",\"\",設定!$C$12)","v":"さとる"},null,{"$f":"IF(設定!$C$12=\"\",\"\",設定!$C$12)","v":"さとる"},null,{"$f":"IF(設定!$C$12=\"\",\"\",設定!$C$12)","v":"さとる"},null,{"$f":"IF(設定!$C$12=\"\",\"\",設定!$C$12)","v":"さとる"},null,{"$f":"IF(設定!$C$12=\"\",\"\",設定!$C$12)","v":"さとる"},null,{"$f":"IF(設定!$C$12=\"\",\"\",設定!$C$12)","v":"さとる"}]
[null,{"$f":"IF(設定!$C$13=\"\",\"\",設定!$C$13)","v":"くるみ"},null,{"$f":"IF(設定!$C$13=\"\",\"\",設定!$C$13)","v":"くるみ"},null,{"$f":"IF(設定!$C$13=\"\",\"\",設定!$C$13)","v":"くるみ"},null,{"$f":"IF(設定!$C$13=\"\",\"\",設定!$C$13)","v":"くるみ"},null,{"$f":"IF(設定!$C$13=\"\",\"\",設定!$C$13)","v":"くるみ"},null,{"$f":"IF(設定!$C$13=\"\",\"\",設定!$C$13)","v":"くるみ"},null,{"$f":"IF(設定!$C$13=\"\",\"\",設定!$C$13)","v":"くるみ"}]
[null,{"$f":"IF(設定!$C$14=\"\",\"\",設定!$C$14)","v":"ともか"},null,{"$f":"IF(設定!$C$14=\"\",\"\",設定!$C$14)","v":"ともか"},null,{"$f":"IF(設定!$C$14=\"\",\"\",設定!$C$14)","v":"ともか"},null,{"$f":"IF(設定!$C$14=\"\",\"\",設定!$C$14)","v":"ともか"},null,{"$f":"IF(設定!$C$14=\"\",\"\",設定!$C$14)","v":"ともか"},null,{"$f":"IF(設定!$C$14=\"\",\"\",設定!$C$14)","v":"ともか"},null,{"$f":"IF(設定!$C$14=\"\",\"\",設定!$C$14)","v":"ともか"}]
[null,{"$f":"$B$5","v":"月"},null,{"$f":"$D$5","v":"火"},null,{"$f":"$F$5","v":"水"},null,{"$f":"$H$5","v":"木"},null,{"$f":"$J$5","v":"金"},null,{"$f":"$L$5","v":"土"},null,{"$f":"$N$5","v":"日"}]
[null,{"$f":"$N430+1","v":13},{"$f":"IF(ISERROR(VLOOKUP(DATE($E$419,$B$418,B438),Holiday,2,FALSE)),\"\",VLOOKUP(DATE($E$419,$B$418,B438),Holiday,2,FALSE))","v":""},{"$f":"B438+1","v":14},{"$f":"IF(ISERROR(VLOOKUP(DATE($E$419,$B$418,D438),Holiday,2,FALSE)),\"\",VLOOKUP(DATE($E$419,$B$418,D438),Holiday,2,FALSE))","v":""},{"$f":"D438+1","v":15},{"$f":"IF(ISERROR(VLOOKUP(DATE($E$419,$B$418,F438),Holiday,2,FALSE)),\"\",VLOOKUP(DATE($E$419,$B$418,F438),Holiday,2,FALSE))","v":""},{"$f":"F438+1","v":16},{"$f":"IF(ISERROR(VLOOKUP(DATE($E$419,$B$418,H438),Holiday,2,FALSE)),\"\",VLOOKUP(DATE($E$419,$B$418,H438),Holiday,2,FALSE))","v":""},{"$f":"H438+1","v":17},{"$f":"IF(ISERROR(VLOOKUP(DATE($E$419,$B$418,J438),Holiday,2,FALSE)),\"\",VLOOKUP(DATE($E$419,$B$418,J438),Holiday,2,FALSE))","v":""},{"$f":"J438+1","v":18},{"$f":"IF(ISERROR(VLOOKUP(DATE($E$419,$B$418,L438),Holiday,2,FALSE)),\"\",VLOOKUP(DATE($E$419,$B$418,L438),Holiday,2,FALSE))","v":""},{"$f":"L438+1","v":19},{"$f":"IF(ISERROR(VLOOKUP(DATE($E$419,$B$418,N438),Holiday,2,FALSE)),\"\",VLOOKUP(DATE($E$419,$B$418,N438),Holiday,2,FALSE))","v":""}]
[]
[null,{"$f":"IF(設定!$C$10=\"\",\"\",設定!$C$10)","v":"パパ"},null,{"$f":"IF(設定!$C$10=\"\",\"\",設定!$C$10)","v":"パパ"},null,{"$f":"IF(設定!$C$10=\"\",\"\",設定!$C$10)","v":"パパ"},null,{"$f":"IF(設定!$C$10=\"\",\"\",設定!$C$10)","v":"パパ"},null,{"$f":"IF(設定!$C$10=\"\",\"\",設定!$C$10)","v":"パパ"},null,{"$f":"IF(設定!$C$10=\"\",\"\",設定!$C$10)","v":"パパ"},null,{"$f":"IF(設定!$C$10=\"\",\"\",設定!$C$10)","v":"パパ"}]
[null,{"$f":"IF(設定!$C$11=\"\",\"\",設定!$C$11)","v":"ママ"},null,{"$f":"IF(設定!$C$11=\"\",\"\",設定!$C$11)","v":"ママ"},null,{"$f":"IF(設定!$C$11=\"\",\"\",設定!$C$11)","v":"ママ"},null,{"$f":"IF(設定!$C$11=\"\",\"\",設定!$C$11)","v":"ママ"},null,{"$f":"IF(設定!$C$11=\"\",\"\",設定!$C$11)","v":"ママ"},null,{"$f":"IF(設定!$C$11=\"\",\"\",設定!$C$11)","v":"ママ"},null,{"$f":"IF(設定!$C$11=\"\",\"\",設定!$C$11)","v":"ママ"}]
[null,{"$f":"IF(設定!$C$12=\"\",\"\",設定!$C$12)","v":"さとる"},null,{"$f":"IF(設定!$C$12=\"\",\"\",設定!$C$12)","v":"さとる"},null,{"$f":"IF(設定!$C$12=\"\",\"\",設定!$C$12)","v":"さとる"},null,{"$f":"IF(設定!$C$12=\"\",\"\",設定!$C$12)","v":"さとる"},null,{"$f":"IF(設定!$C$12=\"\",\"\",設定!$C$12)","v":"さとる"},null,{"$f":"IF(設定!$C$12=\"\",\"\",設定!$C$12)","v":"さとる"},null,{"$f":"IF(設定!$C$12=\"\",\"\",設定!$C$12)","v":"さとる"}]
[null,{"$f":"IF(設定!$C$13=\"\",\"\",設定!$C$13)","v":"くるみ"},null,{"$f":"IF(設定!$C$13=\"\",\"\",設定!$C$13)","v":"くるみ"},null,{"$f":"IF(設定!$C$13=\"\",\"\",設定!$C$13)","v":"くるみ"},null,{"$f":"IF(設定!$C$13=\"\",\"\",設定!$C$13)","v":"くるみ"},null,{"$f":"IF(設定!$C$13=\"\",\"\",設定!$C$13)","v":"くるみ"},null,{"$f":"IF(設定!$C$13=\"\",\"\",設定!$C$13)","v":"くるみ"},null,{"$f":"IF(設定!$C$13=\"\",\"\",設定!$C$13)","v":"くるみ"}]
[null,{"$f":"IF(設定!$C$14=\"\",\"\",設定!$C$14)","v":"ともか"},null,{"$f":"IF(設定!$C$14=\"\",\"\",設定!$C$14)","v":"ともか"},null,{"$f":"IF(設定!$C$14=\"\",\"\",設定!$C$14)","v":"ともか"},null,{"$f":"IF(設定!$C$14=\"\",\"\",設定!$C$14)","v":"ともか"},null,{"$f":"IF(設定!$C$14=\"\",\"\",設定!$C$14)","v":"ともか"},null,{"$f":"IF(設定!$C$14=\"\",\"\",設定!$C$14)","v":"ともか"},null,{"$f":"IF(設定!$C$14=\"\",\"\",設定!$C$14)","v":"ともか"}]
[null,{"$f":"$B$5","v":"月"},null,{"$f":"$D$5","v":"火"},null,{"$f":"$F$5","v":"水"},null,{"$f":"$H$5","v":"木"},null,{"$f":"$J$5","v":"金"},null,{"$f":"$L$5","v":"土"},null,{"$f":"$N$5","v":"日"}]
[null,{"$f":"$N438+1","v":20},{"$f":"IF(ISERROR(VLOOKUP(DATE($E$419,$B$418,B446),Holiday,2,FALSE)),\"\",VLOOKUP(DATE($E$419,$B$418,B446),Holiday,2,FALSE))","v":"敬老の日"},{"$f":"B446+1","v":21},{"$f":"IF(ISERROR(VLOOKUP(DATE($E$419,$B$418,D446),Holiday,2,FALSE)),\"\",VLOOKUP(DATE($E$419,$B$418,D446),Holiday,2,FALSE))","v":""},{"$f":"D446+1","v":22},{"$f":"IF(ISERROR(VLOOKUP(DATE($E$419,$B$418,F446),Holiday,2,FALSE)),\"\",VLOOKUP(DATE($E$419,$B$418,F446),Holiday,2,FALSE))","v":""},{"$f":"F446+1","v":23},{"$f":"IF(ISERROR(VLOOKUP(DATE($E$419,$B$418,H446),Holiday,2,FALSE)),\"\",VLOOKUP(DATE($E$419,$B$418,H446),Holiday,2,FALSE))","v":"秋分の日"},{"$f":"H446+1","v":24},{"$f":"IF(ISERROR(VLOOKUP(DATE($E$419,$B$418,J446),Holiday,2,FALSE)),\"\",VLOOKUP(DATE($E$419,$B$418,J446),Holiday,2,FALSE))","v":""},{"$f":"J446+1","v":25},{"$f":"IF(ISERROR(VLOOKUP(DATE($E$419,$B$418,L446),Holiday,2,FALSE)),\"\",VLOOKUP(DATE($E$419,$B$418,L446),Holiday,2,FALSE))","v":""},{"$f":"L446+1","v":26},{"$f":"IF(ISERROR(VLOOKUP(DATE($E$419,$B$418,N446),Holiday,2,FALSE)),\"\",VLOOKUP(DATE($E$419,$B$418,N446),Holiday,2,FALSE))","v":""}]
[]
[null,{"$f":"IF(設定!$C$10=\"\",\"\",設定!$C$10)","v":"パパ"},null,{"$f":"IF(設定!$C$10=\"\",\"\",設定!$C$10)","v":"パパ"},null,{"$f":"IF(設定!$C$10=\"\",\"\",設定!$C$10)","v":"パパ"},null,{"$f":"IF(設定!$C$10=\"\",\"\",設定!$C$10)","v":"パパ"},null,{"$f":"IF(設定!$C$10=\"\",\"\",設定!$C$10)","v":"パパ"},null,{"$f":"IF(設定!$C$10=\"\",\"\",設定!$C$10)","v":"パパ"},null,{"$f":"IF(設定!$C$10=\"\",\"\",設定!$C$10)","v":"パパ"}]
[null,{"$f":"IF(設定!$C$11=\"\",\"\",設定!$C$11)","v":"ママ"},null,{"$f":"IF(設定!$C$11=\"\",\"\",設定!$C$11)","v":"ママ"},null,{"$f":"IF(設定!$C$11=\"\",\"\",設定!$C$11)","v":"ママ"},null,{"$f":"IF(設定!$C$11=\"\",\"\",設定!$C$11)","v":"ママ"},null,{"$f":"IF(設定!$C$11=\"\",\"\",設定!$C$11)","v":"ママ"},null,{"$f":"IF(設定!$C$11=\"\",\"\",設定!$C$11)","v":"ママ"},null,{"$f":"IF(設定!$C$11=\"\",\"\",設定!$C$11)","v":"ママ"}]
[null,{"$f":"IF(設定!$C$12=\"\",\"\",設定!$C$12)","v":"さとる"},null,{"$f":"IF(設定!$C$12=\"\",\"\",設定!$C$12)","v":"さとる"},null,{"$f":"IF(設定!$C$12=\"\",\"\",設定!$C$12)","v":"さとる"},null,{"$f":"IF(設定!$C$12=\"\",\"\",設定!$C$12)","v":"さとる"},null,{"$f":"IF(設定!$C$12=\"\",\"\",設定!$C$12)","v":"さとる"},null,{"$f":"IF(設定!$C$12=\"\",\"\",設定!$C$12)","v":"さとる"},null,{"$f":"IF(設定!$C$12=\"\",\"\",設定!$C$12)","v":"さとる"}]
[null,{"$f":"IF(設定!$C$13=\"\",\"\",設定!$C$13)","v":"くるみ"},null,{"$f":"IF(設定!$C$13=\"\",\"\",設定!$C$13)","v":"くるみ"},null,{"$f":"IF(設定!$C$13=\"\",\"\",設定!$C$13)","v":"くるみ"},null,{"$f":"IF(設定!$C$13=\"\",\"\",設定!$C$13)","v":"くるみ"},null,{"$f":"IF(設定!$C$13=\"\",\"\",設定!$C$13)","v":"くるみ"},null,{"$f":"IF(設定!$C$13=\"\",\"\",設定!$C$13)","v":"くるみ"},null,{"$f":"IF(設定!$C$13=\"\",\"\",設定!$C$13)","v":"くるみ"}]
[null,{"$f":"IF(設定!$C$14=\"\",\"\",設定!$C$14)","v":"ともか"},null,{"$f":"IF(設定!$C$14=\"\",\"\",設定!$C$14)","v":"ともか"},null,{"$f":"IF(設定!$C$14=\"\",\"\",設定!$C$14)","v":"ともか"},null,{"$f":"IF(設定!$C$14=\"\",\"\",設定!$C$14)","v":"ともか"},null,{"$f":"IF(設定!$C$14=\"\",\"\",設定!$C$14)","v":"ともか"},null,{"$f":"IF(設定!$C$14=\"\",\"\",設定!$C$14)","v":"ともか"},null,{"$f":"IF(設定!$C$14=\"\",\"\",設定!$C$14)","v":"ともか"}]
[null,{"$f":"$B$5","v":"月"},null,{"$f":"$D$5","v":"火"},null,{"$f":"$F$5","v":"水"},null,{"$f":"$H$5","v":"木"},null,{"$f":"$J$5","v":"金"},null,{"$f":"$L$5","v":"土"},null,{"$f":"$N$5","v":"日"}]
[null,{"$f":"$N446+1","v":27},{"$f":"IF(ISERROR(VLOOKUP(DATE($E$471,$B$470,B454),Holiday,2,FALSE)),\"\",VLOOKUP(DATE($E$471,$B$470,B454),Holiday,2,FALSE))","v":""},{"$f":"B454+1","v":28},{"$f":"IF(ISERROR(VLOOKUP(DATE($E$471,$B$470,D454),Holiday,2,FALSE)),\"\",VLOOKUP(DATE($E$471,$B$470,D454),Holiday,2,FALSE))","v":""},{"$f":"D454+1","v":29},{"$f":"IF(ISERROR(VLOOKUP(DATE($E$471,$B$470,F454),Holiday,2,FALSE)),\"\",VLOOKUP(DATE($E$471,$B$470,F454),Holiday,2,FALSE))","v":""},{"$f":"F454+1","v":30},{"$f":"IF(ISERROR(VLOOKUP(DATE($E$471,$B$470,H454),Holiday,2,FALSE)),\"\",VLOOKUP(DATE($E$471,$B$470,H454),Holiday,2,FALSE))","v":""},{"$f":"H454+1","v":31},{"$f":"IF(ISERROR(VLOOKUP(DATE($E$471,$B$470,J454),Holiday,2,FALSE)),\"\",VLOOKUP(DATE($E$471,$B$470,J454),Holiday,2,FALSE))","v":""},{"$f":"J454+1","v":32},{"$f":"IF(ISERROR(VLOOKUP(DATE($E$471,$B$470,L454),Holiday,2,FALSE)),\"\",VLOOKUP(DATE($E$471,$B$470,L454),Holiday,2,FALSE))","v":""},{"$f":"L454+1","v":33},{"$f":"IF(ISERROR(VLOOKUP(DATE($E$471,$B$470,N454),Holiday,2,FALSE)),\"\",VLOOKUP(DATE($E$471,$B$470,N454),Holiday,2,FALSE))","v":""}]
[]
[null,{"$f":"IF(設定!$C$10=\"\",\"\",設定!$C$10)","v":"パパ"},null,{"$f":"IF(設定!$C$10=\"\",\"\",設定!$C$10)","v":"パパ"},null,{"$f":"IF(設定!$C$10=\"\",\"\",設定!$C$10)","v":"パパ"},null,{"$f":"IF(設定!$C$10=\"\",\"\",設定!$C$10)","v":"パパ"},null,{"$f":"IF(設定!$C$10=\"\",\"\",設定!$C$10)","v":"パパ"},null,{"$f":"IF(設定!$C$10=\"\",\"\",設定!$C$10)","v":"パパ"},null,{"$f":"IF(設定!$C$10=\"\",\"\",設定!$C$10)","v":"パパ"}]
[null,{"$f":"IF(設定!$C$11=\"\",\"\",設定!$C$11)","v":"ママ"},null,{"$f":"IF(設定!$C$11=\"\",\"\",設定!$C$11)","v":"ママ"},null,{"$f":"IF(設定!$C$11=\"\",\"\",設定!$C$11)","v":"ママ"},null,{"$f":"IF(設定!$C$11=\"\",\"\",設定!$C$11)","v":"ママ"},null,{"$f":"IF(設定!$C$11=\"\",\"\",設定!$C$11)","v":"ママ"},null,{"$f":"IF(設定!$C$11=\"\",\"\",設定!$C$11)","v":"ママ"},null,{"$f":"IF(設定!$C$11=\"\",\"\",設定!$C$11)","v":"ママ"}]
[null,{"$f":"IF(設定!$C$12=\"\",\"\",設定!$C$12)","v":"さとる"},null,{"$f":"IF(設定!$C$12=\"\",\"\",設定!$C$12)","v":"さとる"},null,{"$f":"IF(設定!$C$12=\"\",\"\",設定!$C$12)","v":"さとる"},null,{"$f":"IF(設定!$C$12=\"\",\"\",設定!$C$12)","v":"さとる"},null,{"$f":"IF(設定!$C$12=\"\",\"\",設定!$C$12)","v":"さとる"},null,{"$f":"IF(設定!$C$12=\"\",\"\",設定!$C$12)","v":"さとる"},null,{"$f":"IF(設定!$C$12=\"\",\"\",設定!$C$12)","v":"さとる"}]
[null,{"$f":"IF(設定!$C$13=\"\",\"\",設定!$C$13)","v":"くるみ"},null,{"$f":"IF(設定!$C$13=\"\",\"\",設定!$C$13)","v":"くるみ"},null,{"$f":"IF(設定!$C$13=\"\",\"\",設定!$C$13)","v":"くるみ"},null,{"$f":"IF(設定!$C$13=\"\",\"\",設定!$C$13)","v":"くるみ"},null,{"$f":"IF(設定!$C$13=\"\",\"\",設定!$C$13)","v":"くるみ"},null,{"$f":"IF(設定!$C$13=\"\",\"\",設定!$C$13)","v":"くるみ"},null,{"$f":"IF(設定!$C$13=\"\",\"\",設定!$C$13)","v":"くるみ"}]
[null,{"$f":"IF(設定!$C$14=\"\",\"\",設定!$C$14)","v":"ともか"},null,{"$f":"IF(設定!$C$14=\"\",\"\",設定!$C$14)","v":"ともか"},null,{"$f":"IF(設定!$C$14=\"\",\"\",設定!$C$14)","v":"ともか"},null,{"$f":"IF(設定!$C$14=\"\",\"\",設定!$C$14)","v":"ともか"},null,{"$f":"IF(設定!$C$14=\"\",\"\",設定!$C$14)","v":"ともか"},null,{"$f":"IF(設定!$C$14=\"\",\"\",設定!$C$14)","v":"ともか"},null,{"$f":"IF(設定!$C$14=\"\",\"\",設定!$C$14)","v":"ともか"}]
[null,{"$f":"$B$5","v":"月"},null,{"$f":"$D$5","v":"火"},null,{"$f":"$F$5","v":"水"},null,{"$f":"$H$5","v":"木"},null,{"$f":"$J$5","v":"金"},null,{"$f":"$L$5","v":"土"},null,{"$f":"$N$5","v":"日"}]
[null,{"$f":"$N454+1","v":34},{"$f":"IF(ISERROR(VLOOKUP(DATE($E$471,$B$470,B462),Holiday,2,FALSE)),\"\",VLOOKUP(DATE($E$471,$B$470,B462),Holiday,2,FALSE))","v":"文化の日"},{"$f":"B462+1","v":35},{"$f":"IF(ISERROR(VLOOKUP(DATE($E$471,$B$470,D462),Holiday,2,FALSE)),\"\",VLOOKUP(DATE($E$471,$B$470,D462),Holiday,2,FALSE))","v":""},{"$f":"D462+1","v":36},{"$f":"IF(ISERROR(VLOOKUP(DATE($E$471,$B$470,F462),Holiday,2,FALSE)),\"\",VLOOKUP(DATE($E$471,$B$470,F462),Holiday,2,FALSE))","v":""},{"$f":"F462+1","v":37},{"$f":"IF(ISERROR(VLOOKUP(DATE($E$471,$B$470,H462),Holiday,2,FALSE)),\"\",VLOOKUP(DATE($E$471,$B$470,H462),Holiday,2,FALSE))","v":""},{"$f":"H462+1","v":38},{"$f":"IF(ISERROR(VLOOKUP(DATE($E$471,$B$470,J462),Holiday,2,FALSE)),\"\",VLOOKUP(DATE($E$471,$B$470,J462),Holiday,2,FALSE))","v":""},{"$f":"J462+1","v":39},{"$f":"IF(ISERROR(VLOOKUP(DATE($E$471,$B$470,L462),Holiday,2,FALSE)),\"\",VLOOKUP(DATE($E$471,$B$470,L462),Holiday,2,FALSE))","v":""},{"$f":"L462+1","v":40},{"$f":"IF(ISERROR(VLOOKUP(DATE($E$471,$B$470,N462),Holiday,2,FALSE)),\"\",VLOOKUP(DATE($E$471,$B$470,N462),Holiday,2,FALSE))","v":""}]
[]
[null,{"$f":"IF(設定!$C$10=\"\",\"\",設定!$C$10)","v":"パパ"},null,{"$f":"IF(設定!$C$10=\"\",\"\",設定!$C$10)","v":"パパ"},null,{"$f":"IF(設定!$C$10=\"\",\"\",設定!$C$10)","v":"パパ"},null,{"$f":"IF(設定!$C$10=\"\",\"\",設定!$C$10)","v":"パパ"},null,{"$f":"IF(設定!$C$10=\"\",\"\",設定!$C$10)","v":"パパ"},null,{"$f":"IF(設定!$C$10=\"\",\"\",設定!$C$10)","v":"パパ"},null,{"$f":"IF(設定!$C$10=\"\",\"\",設定!$C$10)","v":"パパ"}]
[null,{"$f":"IF(設定!$C$11=\"\",\"\",設定!$C$11)","v":"ママ"},null,{"$f":"IF(設定!$C$11=\"\",\"\",設定!$C$11)","v":"ママ"},null,{"$f":"IF(設定!$C$11=\"\",\"\",設定!$C$11)","v":"ママ"},null,{"$f":"IF(設定!$C$11=\"\",\"\",設定!$C$11)","v":"ママ"},null,{"$f":"IF(設定!$C$11=\"\",\"\",設定!$C$11)","v":"ママ"},null,{"$f":"IF(設定!$C$11=\"\",\"\",設定!$C$11)","v":"ママ"},null,{"$f":"IF(設定!$C$11=\"\",\"\",設定!$C$11)","v":"ママ"}]
[null,{"$f":"IF(設定!$C$12=\"\",\"\",設定!$C$12)","v":"さとる"},null,{"$f":"IF(設定!$C$12=\"\",\"\",設定!$C$12)","v":"さとる"},null,{"$f":"IF(設定!$C$12=\"\",\"\",設定!$C$12)","v":"さとる"},null,{"$f":"IF(設定!$C$12=\"\",\"\",設定!$C$12)","v":"さとる"},null,{"$f":"IF(設定!$C$12=\"\",\"\",設定!$C$12)","v":"さとる"},null,{"$f":"IF(設定!$C$12=\"\",\"\",設定!$C$12)","v":"さとる"},null,{"$f":"IF(設定!$C$12=\"\",\"\",設定!$C$12)","v":"さとる"}]
[null,{"$f":"IF(設定!$C$13=\"\",\"\",設定!$C$13)","v":"くるみ"},null,{"$f":"IF(設定!$C$13=\"\",\"\",設定!$C$13)","v":"くるみ"},null,{"$f":"IF(設定!$C$13=\"\",\"\",設定!$C$13)","v":"くるみ"},null,{"$f":"IF(設定!$C$13=\"\",\"\",設定!$C$13)","v":"くるみ"},null,{"$f":"IF(設定!$C$13=\"\",\"\",設定!$C$13)","v":"くるみ"},null,{"$f":"IF(設定!$C$13=\"\",\"\",設定!$C$13)","v":"くるみ"},null,{"$f":"IF(設定!$C$13=\"\",\"\",設定!$C$13)","v":"くるみ"}]
[null,{"$f":"IF(設定!$C$14=\"\",\"\",設定!$C$14)","v":"ともか"},null,{"$f":"IF(設定!$C$14=\"\",\"\",設定!$C$14)","v":"ともか"},null,{"$f":"IF(設定!$C$14=\"\",\"\",設定!$C$14)","v":"ともか"},null,{"$f":"IF(設定!$C$14=\"\",\"\",設定!$C$14)","v":"ともか"},null,{"$f":"IF(設定!$C$14=\"\",\"\",設定!$C$14)","v":"ともか"},null,{"$f":"IF(設定!$C$14=\"\",\"\",設定!$C$14)","v":"ともか"},null,{"$f":"IF(設定!$C$14=\"\",\"\",設定!$C$14)","v":"ともか"}]
[2013]
[null,{"$f":"IF(B418+1>12,1,B418+1)","v":10}]
[null,{"$f":"CHOOSE($B470,\"January\",\"February\",\"March\",\"April\",\"May\",\"June\",\"July\",\"August\",\"September\",\"October\",\"November\",\"December\")","v":"October"},null,null,{"$f":"IF(B470=1,E419+1,E419)","v":2021}]
[]
[null,{"$f":"$B$5","v":"月"},null,{"$f":"$D$5","v":"火"},null,{"$f":"$F$5","v":"水"},null,{"$f":"$H$5","v":"木"},null,{"$f":"$J$5","v":"金"},null,{"$f":"$L$5","v":"土"},null,{"$f":"$N$5","v":"日"}]
[null,{"$f":"IF(IF(B473=\"日\",1,2)>=WEEKDAY(DATE($E471,$B470,1)),IF(IF(B473=\"日\",1,2)-WEEKDAY(DATE($E471,$B470,1))+1>1,\"\",IF(B473=\"日\",1,2)-WEEKDAY(DATE($E471,$B470,1))+1),\"\")","v":""},{"$f":"IF(ISERROR(VLOOKUP(DATE($E$471,$B$470,B474),Holiday,2,FALSE)),\"\",VLOOKUP(DATE($E$471,$B$470,B474),Holiday,2,FALSE))","v":""},{"$f":"IF(IF(D473=\"月\",2,3)>=WEEKDAY(DATE($E471,$B470,1)),IF(IF(D473=\"月\",2,3)-WEEKDAY(DATE($E471,$B470,1))+1>2,\"\",IF(D473=\"月\",2,3)-WEEKDAY(DATE($E471,$B470,1))+1),\"\")","v":""},{"$f":"IF(ISERROR(VLOOKUP(DATE($E$471,$B$470,D474),Holiday,2,FALSE)),\"\",VLOOKUP(DATE($E$471,$B$470,D474),Holiday,2,FALSE))","v":""},{"$f":"IF(IF(F473=\"火\",3,4)>=WEEKDAY(DATE($E471,$B470,1)),IF(IF(F473=\"火\",3,4)-WEEKDAY(DATE($E471,$B470,1))+1>3,\"\",IF(F473=\"火\",3,4)-WEEKDAY(DATE($E471,$B470,1))+1),\"\")","v":""},{"$f":"IF(ISERROR(VLOOKUP(DATE($E$471,$B$470,F474),Holiday,2,FALSE)),\"\",VLOOKUP(DATE($E$471,$B$470,F474),Holiday,2,FALSE))","v":""},{"$f":"IF(IF(H473=\"水\",4,5)>=WEEKDAY(DATE($E471,$B470,1)),IF(IF(H473=\"水\",4,5)-WEEKDAY(DATE($E471,$B470,1))+1>4,\"\",IF(H473=\"水\",4,5)-WEEKDAY(DATE($E471,$B470,1))+1),\"\")","v":""},{"$f":"IF(ISERROR(VLOOKUP(DATE($E$471,$B$470,H474),Holiday,2,FALSE)),\"\",VLOOKUP(DATE($E$471,$B$470,H474),Holiday,2,FALSE))","v":""},{"$f":"IF(IF(J473=\"木\",5,6)>=WEEKDAY(DATE($E471,$B470,1)),IF(IF(J473=\"木\",5,6)-WEEKDAY(DATE($E471,$B470,1))+1>5,\"\",IF(J473=\"木\",5,6)-WEEKDAY(DATE($E471,$B470,1))+1),\"\")","v":1},{"$f":"IF(ISERROR(VLOOKUP(DATE($E$471,$B$470,J474),Holiday,2,FALSE)),\"\",VLOOKUP(DATE($E$471,$B$470,J474),Holiday,2,FALSE))","v":""},{"$f":"IF(IF(L473=\"金\",6,7)>=WEEKDAY(DATE($E471,$B470,1)),IF(IF(L473=\"金\",6,7)-WEEKDAY(DATE($E471,$B470,1))+1>6,\"\",IF(L473=\"金\",6,7)-WEEKDAY(DATE($E471,$B470,1))+1),\"\")","v":2},{"$f":"IF(ISERROR(VLOOKUP(DATE($E$471,$B$470,L474),Holiday,2,FALSE)),\"\",VLOOKUP(DATE($E$471,$B$470,L474),Holiday,2,FALSE))","v":""},{"$f":"IF(L474=\"\",IF(IF(N473=\"土\",7,1)>=WEEKDAY(DATE($E471,$B470,1)),IF(N473=\"土\",7,1)-WEEKDAY(DATE($E471,$B470,1))+1),L474+1)","v":3},{"$f":"IF(ISERROR(VLOOKUP(DATE($E$471,$B$470,N474),Holiday,2,FALSE)),\"\",VLOOKUP(DATE($E$471,$B$470,N474),Holiday,2,FALSE))","v":""}]
[]
[null,{"$f":"IF(設定!$C$10=\"\",\"\",設定!$C$10)","v":"パパ"},null,{"$f":"IF(設定!$C$10=\"\",\"\",設定!$C$10)","v":"パパ"},null,{"$f":"IF(設定!$C$10=\"\",\"\",設定!$C$10)","v":"パパ"},null,{"$f":"IF(設定!$C$10=\"\",\"\",設定!$C$10)","v":"パパ"},null,{"$f":"IF(設定!$C$10=\"\",\"\",設定!$C$10)","v":"パパ"},null,{"$f":"IF(設定!$C$10=\"\",\"\",設定!$C$10)","v":"パパ"},null,{"$f":"IF(設定!$C$10=\"\",\"\",設定!$C$10)","v":"パパ"}]
[null,{"$f":"IF(設定!$C$11=\"\",\"\",設定!$C$11)","v":"ママ"},null,{"$f":"IF(設定!$C$11=\"\",\"\",設定!$C$11)","v":"ママ"},null,{"$f":"IF(設定!$C$11=\"\",\"\",設定!$C$11)","v":"ママ"},null,{"$f":"IF(設定!$C$11=\"\",\"\",設定!$C$11)","v":"ママ"},null,{"$f":"IF(設定!$C$11=\"\",\"\",設定!$C$11)","v":"ママ"},null,{"$f":"IF(設定!$C$11=\"\",\"\",設定!$C$11)","v":"ママ"},null,{"$f":"IF(設定!$C$11=\"\",\"\",設定!$C$11)","v":"ママ"}]
[null,{"$f":"IF(設定!$C$12=\"\",\"\",設定!$C$12)","v":"さとる"},null,{"$f":"IF(設定!$C$12=\"\",\"\",設定!$C$12)","v":"さとる"},null,{"$f":"IF(設定!$C$12=\"\",\"\",設定!$C$12)","v":"さとる"},null,{"$f":"IF(設定!$C$12=\"\",\"\",設定!$C$12)","v":"さとる"},null,{"$f":"IF(設定!$C$12=\"\",\"\",設定!$C$12)","v":"さとる"},null,{"$f":"IF(設定!$C$12=\"\",\"\",設定!$C$12)","v":"さとる"},null,{"$f":"IF(設定!$C$12=\"\",\"\",設定!$C$12)","v":"さとる"}]
[null,{"$f":"IF(設定!$C$13=\"\",\"\",設定!$C$13)","v":"くるみ"},null,{"$f":"IF(設定!$C$13=\"\",\"\",設定!$C$13)","v":"くるみ"},null,{"$f":"IF(設定!$C$13=\"\",\"\",設定!$C$13)","v":"くるみ"},null,{"$f":"IF(設定!$C$13=\"\",\"\",設定!$C$13)","v":"くるみ"},null,{"$f":"IF(設定!$C$13=\"\",\"\",設定!$C$13)","v":"くるみ"},null,{"$f":"IF(設定!$C$13=\"\",\"\",設定!$C$13)","v":"くるみ"},null,{"$f":"IF(設定!$C$13=\"\",\"\",設定!$C$13)","v":"くるみ"}]
[null,{"$f":"IF(設定!$C$14=\"\",\"\",設定!$C$14)","v":"ともか"},null,{"$f":"IF(設定!$C$14=\"\",\"\",設定!$C$14)","v":"ともか"},null,{"$f":"IF(設定!$C$14=\"\",\"\",設定!$C$14)","v":"ともか"},null,{"$f":"IF(設定!$C$14=\"\",\"\",設定!$C$14)","v":"ともか"},null,{"$f":"IF(設定!$C$14=\"\",\"\",設定!$C$14)","v":"ともか"},null,{"$f":"IF(設定!$C$14=\"\",\"\",設定!$C$14)","v":"ともか"},null,{"$f":"IF(設定!$C$14=\"\",\"\",設定!$C$14)","v":"ともか"}]
[null,{"$f":"$B$5","v":"月"},null,{"$f":"$D$5","v":"火"},null,{"$f":"$F$5","v":"水"},null,{"$f":"$H$5","v":"木"},null,{"$f":"$J$5","v":"金"},null,{"$f":"$L$5","v":"土"},null,{"$f":"$N$5","v":"日"}]
[null,{"$f":"$N474+1","v":4},{"$f":"IF(ISERROR(VLOOKUP(DATE($E$471,$B$470,B482),Holiday,2,FALSE)),\"\",VLOOKUP(DATE($E$471,$B$470,B482),Holiday,2,FALSE))","v":""},{"$f":"B482+1","v":5},{"$f":"IF(ISERROR(VLOOKUP(DATE($E$471,$B$470,D482),Holiday,2,FALSE)),\"\",VLOOKUP(DATE($E$471,$B$470,D482),Holiday,2,FALSE))","v":""},{"$f":"D482+1","v":6},{"$f":"IF(ISERROR(VLOOKUP(DATE($E$471,$B$470,F482),Holiday,2,FALSE)),\"\",VLOOKUP(DATE($E$471,$B$470,F482),Holiday,2,FALSE))","v":""},{"$f":"F482+1","v":7},{"$f":"IF(ISERROR(VLOOKUP(DATE($E$471,$B$470,H482),Holiday,2,FALSE)),\"\",VLOOKUP(DATE($E$471,$B$470,H482),Holiday,2,FALSE))","v":""},{"$f":"H482+1","v":8},{"$f":"IF(ISERROR(VLOOKUP(DATE($E$471,$B$470,J482),Holiday,2,FALSE)),\"\",VLOOKUP(DATE($E$471,$B$470,J482),Holiday,2,FALSE))","v":""},{"$f":"J482+1","v":9},{"$f":"IF(ISERROR(VLOOKUP(DATE($E$471,$B$470,L482),Holiday,2,FALSE)),\"\",VLOOKUP(DATE($E$471,$B$470,L482),Holiday,2,FALSE))","v":""},{"$f":"L482+1","v":10},{"$f":"IF(ISERROR(VLOOKUP(DATE($E$471,$B$470,N482),Holiday,2,FALSE)),\"\",VLOOKUP(DATE($E$471,$B$470,N482),Holiday,2,FALSE))","v":""}]
[]
[null,{"$f":"IF(設定!$C$10=\"\",\"\",設定!$C$10)","v":"パパ"},null,{"$f":"IF(設定!$C$10=\"\",\"\",設定!$C$10)","v":"パパ"},null,{"$f":"IF(設定!$C$10=\"\",\"\",設定!$C$10)","v":"パパ"},null,{"$f":"IF(設定!$C$10=\"\",\"\",設定!$C$10)","v":"パパ"},null,{"$f":"IF(設定!$C$10=\"\",\"\",設定!$C$10)","v":"パパ"},null,{"$f":"IF(設定!$C$10=\"\",\"\",設定!$C$10)","v":"パパ"},null,{"$f":"IF(設定!$C$10=\"\",\"\",設定!$C$10)","v":"パパ"}]
[null,{"$f":"IF(設定!$C$11=\"\",\"\",設定!$C$11)","v":"ママ"},null,{"$f":"IF(設定!$C$11=\"\",\"\",設定!$C$11)","v":"ママ"},null,{"$f":"IF(設定!$C$11=\"\",\"\",設定!$C$11)","v":"ママ"},null,{"$f":"IF(設定!$C$11=\"\",\"\",設定!$C$11)","v":"ママ"},null,{"$f":"IF(設定!$C$11=\"\",\"\",設定!$C$11)","v":"ママ"},null,{"$f":"IF(設定!$C$11=\"\",\"\",設定!$C$11)","v":"ママ"},null,{"$f":"IF(設定!$C$11=\"\",\"\",設定!$C$11)","v":"ママ"}]
[null,{"$f":"IF(設定!$C$12=\"\",\"\",設定!$C$12)","v":"さとる"},null,{"$f":"IF(設定!$C$12=\"\",\"\",設定!$C$12)","v":"さとる"},null,{"$f":"IF(設定!$C$12=\"\",\"\",設定!$C$12)","v":"さとる"},null,{"$f":"IF(設定!$C$12=\"\",\"\",設定!$C$12)","v":"さとる"},null,{"$f":"IF(設定!$C$12=\"\",\"\",設定!$C$12)","v":"さとる"},null,{"$f":"IF(設定!$C$12=\"\",\"\",設定!$C$12)","v":"さとる"},null,{"$f":"IF(設定!$C$12=\"\",\"\",設定!$C$12)","v":"さとる"}]
[null,{"$f":"IF(設定!$C$13=\"\",\"\",設定!$C$13)","v":"くるみ"},null,{"$f":"IF(設定!$C$13=\"\",\"\",設定!$C$13)","v":"くるみ"},null,{"$f":"IF(設定!$C$13=\"\",\"\",設定!$C$13)","v":"くるみ"},null,{"$f":"IF(設定!$C$13=\"\",\"\",設定!$C$13)","v":"くるみ"},null,{"$f":"IF(設定!$C$13=\"\",\"\",設定!$C$13)","v":"くるみ"},null,{"$f":"IF(設定!$C$13=\"\",\"\",設定!$C$13)","v":"くるみ"},null,{"$f":"IF(設定!$C$13=\"\",\"\",設定!$C$13)","v":"くるみ"}]
[null,{"$f":"IF(設定!$C$14=\"\",\"\",設定!$C$14)","v":"ともか"},null,{"$f":"IF(設定!$C$14=\"\",\"\",設定!$C$14)","v":"ともか"},null,{"$f":"IF(設定!$C$14=\"\",\"\",設定!$C$14)","v":"ともか"},null,{"$f":"IF(設定!$C$14=\"\",\"\",設定!$C$14)","v":"ともか"},null,{"$f":"IF(設定!$C$14=\"\",\"\",設定!$C$14)","v":"ともか"},null,{"$f":"IF(設定!$C$14=\"\",\"\",設定!$C$14)","v":"ともか"},null,{"$f":"IF(設定!$C$14=\"\",\"\",設定!$C$14)","v":"ともか"}]
[null,{"$f":"$B$5","v":"月"},null,{"$f":"$D$5","v":"火"},null,{"$f":"$F$5","v":"水"},null,{"$f":"$H$5","v":"木"},null,{"$f":"$J$5","v":"金"},null,{"$f":"$L$5","v":"土"},null,{"$f":"$N$5","v":"日"}]
[null,{"$f":"$N482+1","v":11},{"$f":"IF(ISERROR(VLOOKUP(DATE($E$471,$B$470,B490),Holiday,2,FALSE)),\"\",VLOOKUP(DATE($E$471,$B$470,B490),Holiday,2,FALSE))","v":"体育の日"},{"$f":"B490+1","v":12},{"$f":"IF(ISERROR(VLOOKUP(DATE($E$471,$B$470,D490),Holiday,2,FALSE)),\"\",VLOOKUP(DATE($E$471,$B$470,D490),Holiday,2,FALSE))","v":""},{"$f":"D490+1","v":13},{"$f":"IF(ISERROR(VLOOKUP(DATE($E$471,$B$470,F490),Holiday,2,FALSE)),\"\",VLOOKUP(DATE($E$471,$B$470,F490),Holiday,2,FALSE))","v":""},{"$f":"F490+1","v":14},{"$f":"IF(ISERROR(VLOOKUP(DATE($E$471,$B$470,H490),Holiday,2,FALSE)),\"\",VLOOKUP(DATE($E$471,$B$470,H490),Holiday,2,FALSE))","v":""},{"$f":"H490+1","v":15},{"$f":"IF(ISERROR(VLOOKUP(DATE($E$471,$B$470,J490),Holiday,2,FALSE)),\"\",VLOOKUP(DATE($E$471,$B$470,J490),Holiday,2,FALSE))","v":""},{"$f":"J490+1","v":16},{"$f":"IF(ISERROR(VLOOKUP(DATE($E$471,$B$470,L490),Holiday,2,FALSE)),\"\",VLOOKUP(DATE($E$471,$B$470,L490),Holiday,2,FALSE))","v":""},{"$f":"L490+1","v":17},{"$f":"IF(ISERROR(VLOOKUP(DATE($E$471,$B$470,N490),Holiday,2,FALSE)),\"\",VLOOKUP(DATE($E$471,$B$470,N490),Holiday,2,FALSE))","v":""}]
[]
[null,{"$f":"IF(設定!$C$10=\"\",\"\",設定!$C$10)","v":"パパ"},null,{"$f":"IF(設定!$C$10=\"\",\"\",設定!$C$10)","v":"パパ"},null,{"$f":"IF(設定!$C$10=\"\",\"\",設定!$C$10)","v":"パパ"},null,{"$f":"IF(設定!$C$10=\"\",\"\",設定!$C$10)","v":"パパ"},null,{"$f":"IF(設定!$C$10=\"\",\"\",設定!$C$10)","v":"パパ"},null,{"$f":"IF(設定!$C$10=\"\",\"\",設定!$C$10)","v":"パパ"},null,{"$f":"IF(設定!$C$10=\"\",\"\",設定!$C$10)","v":"パパ"}]
[null,{"$f":"IF(設定!$C$11=\"\",\"\",設定!$C$11)","v":"ママ"},null,{"$f":"IF(設定!$C$11=\"\",\"\",設定!$C$11)","v":"ママ"},null,{"$f":"IF(設定!$C$11=\"\",\"\",設定!$C$11)","v":"ママ"},null,{"$f":"IF(設定!$C$11=\"\",\"\",設定!$C$11)","v":"ママ"},null,{"$f":"IF(設定!$C$11=\"\",\"\",設定!$C$11)","v":"ママ"},null,{"$f":"IF(設定!$C$11=\"\",\"\",設定!$C$11)","v":"ママ"},null,{"$f":"IF(設定!$C$11=\"\",\"\",設定!$C$11)","v":"ママ"}]
[null,{"$f":"IF(設定!$C$12=\"\",\"\",設定!$C$12)","v":"さとる"},null,{"$f":"IF(設定!$C$12=\"\",\"\",設定!$C$12)","v":"さとる"},null,{"$f":"IF(設定!$C$12=\"\",\"\",設定!$C$12)","v":"さとる"},null,{"$f":"IF(設定!$C$12=\"\",\"\",設定!$C$12)","v":"さとる"},null,{"$f":"IF(設定!$C$12=\"\",\"\",設定!$C$12)","v":"さとる"},null,{"$f":"IF(設定!$C$12=\"\",\"\",設定!$C$12)","v":"さとる"},null,{"$f":"IF(設定!$C$12=\"\",\"\",設定!$C$12)","v":"さとる"}]
[null,{"$f":"IF(設定!$C$13=\"\",\"\",設定!$C$13)","v":"くるみ"},null,{"$f":"IF(設定!$C$13=\"\",\"\",設定!$C$13)","v":"くるみ"},null,{"$f":"IF(設定!$C$13=\"\",\"\",設定!$C$13)","v":"くるみ"},null,{"$f":"IF(設定!$C$13=\"\",\"\",設定!$C$13)","v":"くるみ"},null,{"$f":"IF(設定!$C$13=\"\",\"\",設定!$C$13)","v":"くるみ"},null,{"$f":"IF(設定!$C$13=\"\",\"\",設定!$C$13)","v":"くるみ"},null,{"$f":"IF(設定!$C$13=\"\",\"\",設定!$C$13)","v":"くるみ"}]
[null,{"$f":"IF(設定!$C$14=\"\",\"\",設定!$C$14)","v":"ともか"},null,{"$f":"IF(設定!$C$14=\"\",\"\",設定!$C$14)","v":"ともか"},null,{"$f":"IF(設定!$C$14=\"\",\"\",設定!$C$14)","v":"ともか"},null,{"$f":"IF(設定!$C$14=\"\",\"\",設定!$C$14)","v":"ともか"},null,{"$f":"IF(設定!$C$14=\"\",\"\",設定!$C$14)","v":"ともか"},null,{"$f":"IF(設定!$C$14=\"\",\"\",設定!$C$14)","v":"ともか"},null,{"$f":"IF(設定!$C$14=\"\",\"\",設定!$C$14)","v":"ともか"}]
[null,{"$f":"$B$5","v":"月"},null,{"$f":"$D$5","v":"火"},null,{"$f":"$F$5","v":"水"},null,{"$f":"$H$5","v":"木"},null,{"$f":"$J$5","v":"金"},null,{"$f":"$L$5","v":"土"},null,{"$f":"$N$5","v":"日"}]
[null,{"$f":"$N490+1","v":18},{"$f":"IF(ISERROR(VLOOKUP(DATE($E$471,$B$470,B498),Holiday,2,FALSE)),\"\",VLOOKUP(DATE($E$471,$B$470,B498),Holiday,2,FALSE))","v":""},{"$f":"B498+1","v":19},{"$f":"IF(ISERROR(VLOOKUP(DATE($E$471,$B$470,D498),Holiday,2,FALSE)),\"\",VLOOKUP(DATE($E$471,$B$470,D498),Holiday,2,FALSE))","v":""},{"$f":"D498+1","v":20},{"$f":"IF(ISERROR(VLOOKUP(DATE($E$471,$B$470,F498),Holiday,2,FALSE)),\"\",VLOOKUP(DATE($E$471,$B$470,F498),Holiday,2,FALSE))","v":""},{"$f":"F498+1","v":21},{"$f":"IF(ISERROR(VLOOKUP(DATE($E$471,$B$470,H498),Holiday,2,FALSE)),\"\",VLOOKUP(DATE($E$471,$B$470,H498),Holiday,2,FALSE))","v":""},{"$f":"H498+1","v":22},{"$f":"IF(ISERROR(VLOOKUP(DATE($E$471,$B$470,J498),Holiday,2,FALSE)),\"\",VLOOKUP(DATE($E$471,$B$470,J498),Holiday,2,FALSE))","v":""},{"$f":"J498+1","v":23},{"$f":"IF(ISERROR(VLOOKUP(DATE($E$471,$B$470,L498),Holiday,2,FALSE)),\"\",VLOOKUP(DATE($E$471,$B$470,L498),Holiday,2,FALSE))","v":""},{"$f":"L498+1","v":24},{"$f":"IF(ISERROR(VLOOKUP(DATE($E$471,$B$470,N498),Holiday,2,FALSE)),\"\",VLOOKUP(DATE($E$471,$B$470,N498),Holiday,2,FALSE))","v":""}]
[]
[null,{"$f":"IF(設定!$C$10=\"\",\"\",設定!$C$10)","v":"パパ"},null,{"$f":"IF(設定!$C$10=\"\",\"\",設定!$C$10)","v":"パパ"},null,{"$f":"IF(設定!$C$10=\"\",\"\",設定!$C$10)","v":"パパ"},null,{"$f":"IF(設定!$C$10=\"\",\"\",設定!$C$10)","v":"パパ"},null,{"$f":"IF(設定!$C$10=\"\",\"\",設定!$C$10)","v":"パパ"},null,{"$f":"IF(設定!$C$10=\"\",\"\",設定!$C$10)","v":"パパ"},null,{"$f":"IF(設定!$C$10=\"\",\"\",設定!$C$10)","v":"パパ"}]
[null,{"$f":"IF(設定!$C$11=\"\",\"\",設定!$C$11)","v":"ママ"},null,{"$f":"IF(設定!$C$11=\"\",\"\",設定!$C$11)","v":"ママ"},null,{"$f":"IF(設定!$C$11=\"\",\"\",設定!$C$11)","v":"ママ"},null,{"$f":"IF(設定!$C$11=\"\",\"\",設定!$C$11)","v":"ママ"},null,{"$f":"IF(設定!$C$11=\"\",\"\",設定!$C$11)","v":"ママ"},null,{"$f":"IF(設定!$C$11=\"\",\"\",設定!$C$11)","v":"ママ"},null,{"$f":"IF(設定!$C$11=\"\",\"\",設定!$C$11)","v":"ママ"}]
[null,{"$f":"IF(設定!$C$12=\"\",\"\",設定!$C$12)","v":"さとる"},null,{"$f":"IF(設定!$C$12=\"\",\"\",設定!$C$12)","v":"さとる"},null,{"$f":"IF(設定!$C$12=\"\",\"\",設定!$C$12)","v":"さとる"},null,{"$f":"IF(設定!$C$12=\"\",\"\",設定!$C$12)","v":"さとる"},null,{"$f":"IF(設定!$C$12=\"\",\"\",設定!$C$12)","v":"さとる"},null,{"$f":"IF(設定!$C$12=\"\",\"\",設定!$C$12)","v":"さとる"},null,{"$f":"IF(設定!$C$12=\"\",\"\",設定!$C$12)","v":"さとる"}]
[null,{"$f":"IF(設定!$C$13=\"\",\"\",設定!$C$13)","v":"くるみ"},null,{"$f":"IF(設定!$C$13=\"\",\"\",設定!$C$13)","v":"くるみ"},null,{"$f":"IF(設定!$C$13=\"\",\"\",設定!$C$13)","v":"くるみ"},null,{"$f":"IF(設定!$C$13=\"\",\"\",設定!$C$13)","v":"くるみ"},null,{"$f":"IF(設定!$C$13=\"\",\"\",設定!$C$13)","v":"くるみ"},null,{"$f":"IF(設定!$C$13=\"\",\"\",設定!$C$13)","v":"くるみ"},null,{"$f":"IF(設定!$C$13=\"\",\"\",設定!$C$13)","v":"くるみ"}]
[null,{"$f":"IF(設定!$C$14=\"\",\"\",設定!$C$14)","v":"ともか"},null,{"$f":"IF(設定!$C$14=\"\",\"\",設定!$C$14)","v":"ともか"},null,{"$f":"IF(設定!$C$14=\"\",\"\",設定!$C$14)","v":"ともか"},null,{"$f":"IF(設定!$C$14=\"\",\"\",設定!$C$14)","v":"ともか"},null,{"$f":"IF(設定!$C$14=\"\",\"\",設定!$C$14)","v":"ともか"},null,{"$f":"IF(設定!$C$14=\"\",\"\",設定!$C$14)","v":"ともか"},null,{"$f":"IF(設定!$C$14=\"\",\"\",設定!$C$14)","v":"ともか"}]
[null,{"$f":"$B$5","v":"月"},null,{"$f":"$D$5","v":"火"},null,{"$f":"$F$5","v":"水"},null,{"$f":"$H$5","v":"木"},null,{"$f":"$J$5","v":"金"},null,{"$f":"$L$5","v":"土"},null,{"$f":"$N$5","v":"日"}]
[null,{"$f":"$N498+1","v":25},{"$f":"IF(ISERROR(VLOOKUP(DATE($E$471,$B$470,B506),Holiday,2,FALSE)),\"\",VLOOKUP(DATE($E$471,$B$470,B506),Holiday,2,FALSE))","v":""},{"$f":"B506+1","v":26},{"$f":"IF(ISERROR(VLOOKUP(DATE($E$471,$B$470,D506),Holiday,2,FALSE)),\"\",VLOOKUP(DATE($E$471,$B$470,D506),Holiday,2,FALSE))","v":""},{"$f":"D506+1","v":27},{"$f":"IF(ISERROR(VLOOKUP(DATE($E$471,$B$470,F506),Holiday,2,FALSE)),\"\",VLOOKUP(DATE($E$471,$B$470,F506),Holiday,2,FALSE))","v":""},{"$f":"F506+1","v":28},{"$f":"IF(ISERROR(VLOOKUP(DATE($E$471,$B$470,H506),Holiday,2,FALSE)),\"\",VLOOKUP(DATE($E$471,$B$470,H506),Holiday,2,FALSE))","v":""},{"$f":"H506+1","v":29},{"$f":"IF(ISERROR(VLOOKUP(DATE($E$471,$B$470,J506),Holiday,2,FALSE)),\"\",VLOOKUP(DATE($E$471,$B$470,J506),Holiday,2,FALSE))","v":""},{"$f":"J506+1","v":30},{"$f":"IF(ISERROR(VLOOKUP(DATE($E$471,$B$470,L506),Holiday,2,FALSE)),\"\",VLOOKUP(DATE($E$471,$B$470,L506),Holiday,2,FALSE))","v":""},{"$f":"L506+1","v":31},{"$f":"IF(ISERROR(VLOOKUP(DATE($E$471,$B$470,N506),Holiday,2,FALSE)),\"\",VLOOKUP(DATE($E$471,$B$470,N506),Holiday,2,FALSE))","v":""}]
[]
[null,{"$f":"IF(設定!$C$10=\"\",\"\",設定!$C$10)","v":"パパ"},null,{"$f":"IF(設定!$C$10=\"\",\"\",設定!$C$10)","v":"パパ"},null,{"$f":"IF(設定!$C$10=\"\",\"\",設定!$C$10)","v":"パパ"},null,{"$f":"IF(設定!$C$10=\"\",\"\",設定!$C$10)","v":"パパ"},null,{"$f":"IF(設定!$C$10=\"\",\"\",設定!$C$10)","v":"パパ"},null,{"$f":"IF(設定!$C$10=\"\",\"\",設定!$C$10)","v":"パパ"},null,{"$f":"IF(設定!$C$10=\"\",\"\",設定!$C$10)","v":"パパ"}]
[null,{"$f":"IF(設定!$C$11=\"\",\"\",設定!$C$11)","v":"ママ"},null,{"$f":"IF(設定!$C$11=\"\",\"\",設定!$C$11)","v":"ママ"},null,{"$f":"IF(設定!$C$11=\"\",\"\",設定!$C$11)","v":"ママ"},null,{"$f":"IF(設定!$C$11=\"\",\"\",設定!$C$11)","v":"ママ"},null,{"$f":"IF(設定!$C$11=\"\",\"\",設定!$C$11)","v":"ママ"},null,{"$f":"IF(設定!$C$11=\"\",\"\",設定!$C$11)","v":"ママ"},null,{"$f":"IF(設定!$C$11=\"\",\"\",設定!$C$11)","v":"ママ"}]
[null,{"$f":"IF(設定!$C$12=\"\",\"\",設定!$C$12)","v":"さとる"},null,{"$f":"IF(設定!$C$12=\"\",\"\",設定!$C$12)","v":"さとる"},null,{"$f":"IF(設定!$C$12=\"\",\"\",設定!$C$12)","v":"さとる"},null,{"$f":"IF(設定!$C$12=\"\",\"\",設定!$C$12)","v":"さとる"},null,{"$f":"IF(設定!$C$12=\"\",\"\",設定!$C$12)","v":"さとる"},null,{"$f":"IF(設定!$C$12=\"\",\"\",設定!$C$12)","v":"さとる"},null,{"$f":"IF(設定!$C$12=\"\",\"\",設定!$C$12)","v":"さとる"}]
[null,{"$f":"IF(設定!$C$13=\"\",\"\",設定!$C$13)","v":"くるみ"},null,{"$f":"IF(設定!$C$13=\"\",\"\",設定!$C$13)","v":"くるみ"},null,{"$f":"IF(設定!$C$13=\"\",\"\",設定!$C$13)","v":"くるみ"},null,{"$f":"IF(設定!$C$13=\"\",\"\",設定!$C$13)","v":"くるみ"},null,{"$f":"IF(設定!$C$13=\"\",\"\",設定!$C$13)","v":"くるみ"},null,{"$f":"IF(設定!$C$13=\"\",\"\",設定!$C$13)","v":"くるみ"},null,{"$f":"IF(設定!$C$13=\"\",\"\",設定!$C$13)","v":"くるみ"}]
[null,{"$f":"IF(設定!$C$14=\"\",\"\",設定!$C$14)","v":"ともか"},null,{"$f":"IF(設定!$C$14=\"\",\"\",設定!$C$14)","v":"ともか"},null,{"$f":"IF(設定!$C$14=\"\",\"\",設定!$C$14)","v":"ともか"},null,{"$f":"IF(設定!$C$14=\"\",\"\",設定!$C$14)","v":"ともか"},null,{"$f":"IF(設定!$C$14=\"\",\"\",設定!$C$14)","v":"ともか"},null,{"$f":"IF(設定!$C$14=\"\",\"\",設定!$C$14)","v":"ともか"},null,{"$f":"IF(設定!$C$14=\"\",\"\",設定!$C$14)","v":"ともか"}]
[null,{"$f":"$B$5","v":"月"},null,{"$f":"$D$5","v":"火"},null,{"$f":"$F$5","v":"水"},null,{"$f":"$H$5","v":"木"},null,{"$f":"$J$5","v":"金"},null,{"$f":"$L$5","v":"土"},null,{"$f":"$N$5","v":"日"}]
[null,{"$f":"$N506+1","v":32},{"$f":"IF(ISERROR(VLOOKUP(DATE($E$471,$B$470,B514),Holiday,2,FALSE)),\"\",VLOOKUP(DATE($E$471,$B$470,B514),Holiday,2,FALSE))","v":""},{"$f":"B514+1","v":33},{"$f":"IF(ISERROR(VLOOKUP(DATE($E$471,$B$470,D514),Holiday,2,FALSE)),\"\",VLOOKUP(DATE($E$471,$B$470,D514),Holiday,2,FALSE))","v":""},{"$f":"D514+1","v":34},{"$f":"IF(ISERROR(VLOOKUP(DATE($E$471,$B$470,F514),Holiday,2,FALSE)),\"\",VLOOKUP(DATE($E$471,$B$470,F514),Holiday,2,FALSE))","v":"文化の日"},{"$f":"F514+1","v":35},{"$f":"IF(ISERROR(VLOOKUP(DATE($E$471,$B$470,H514),Holiday,2,FALSE)),\"\",VLOOKUP(DATE($E$471,$B$470,H514),Holiday,2,FALSE))","v":""},{"$f":"H514+1","v":36},{"$f":"IF(ISERROR(VLOOKUP(DATE($E$471,$B$470,J514),Holiday,2,FALSE)),\"\",VLOOKUP(DATE($E$471,$B$470,J514),Holiday,2,FALSE))","v":""},{"$f":"J514+1","v":37},{"$f":"IF(ISERROR(VLOOKUP(DATE($E$471,$B$470,L514),Holiday,2,FALSE)),\"\",VLOOKUP(DATE($E$471,$B$470,L514),Holiday,2,FALSE))","v":""},{"$f":"L514+1","v":38},{"$f":"IF(ISERROR(VLOOKUP(DATE($E$471,$B$470,N514),Holiday,2,FALSE)),\"\",VLOOKUP(DATE($E$471,$B$470,N514),Holiday,2,FALSE))","v":""}]
[]
[null,{"$f":"IF(設定!$C$10=\"\",\"\",設定!$C$10)","v":"パパ"},null,{"$f":"IF(設定!$C$10=\"\",\"\",設定!$C$10)","v":"パパ"},null,{"$f":"IF(設定!$C$10=\"\",\"\",設定!$C$10)","v":"パパ"},null,{"$f":"IF(設定!$C$10=\"\",\"\",設定!$C$10)","v":"パパ"},null,{"$f":"IF(設定!$C$10=\"\",\"\",設定!$C$10)","v":"パパ"},null,{"$f":"IF(設定!$C$10=\"\",\"\",設定!$C$10)","v":"パパ"},null,{"$f":"IF(設定!$C$10=\"\",\"\",設定!$C$10)","v":"パパ"}]
[null,{"$f":"IF(設定!$C$11=\"\",\"\",設定!$C$11)","v":"ママ"},null,{"$f":"IF(設定!$C$11=\"\",\"\",設定!$C$11)","v":"ママ"},null,{"$f":"IF(設定!$C$11=\"\",\"\",設定!$C$11)","v":"ママ"},null,{"$f":"IF(設定!$C$11=\"\",\"\",設定!$C$11)","v":"ママ"},null,{"$f":"IF(設定!$C$11=\"\",\"\",設定!$C$11)","v":"ママ"},null,{"$f":"IF(設定!$C$11=\"\",\"\",設定!$C$11)","v":"ママ"},null,{"$f":"IF(設定!$C$11=\"\",\"\",設定!$C$11)","v":"ママ"}]
[null,{"$f":"IF(設定!$C$12=\"\",\"\",設定!$C$12)","v":"さとる"},null,{"$f":"IF(設定!$C$12=\"\",\"\",設定!$C$12)","v":"さとる"},null,{"$f":"IF(設定!$C$12=\"\",\"\",設定!$C$12)","v":"さとる"},null,{"$f":"IF(設定!$C$12=\"\",\"\",設定!$C$12)","v":"さとる"},null,{"$f":"IF(設定!$C$12=\"\",\"\",設定!$C$12)","v":"さとる"},null,{"$f":"IF(設定!$C$12=\"\",\"\",設定!$C$12)","v":"さとる"},null,{"$f":"IF(設定!$C$12=\"\",\"\",設定!$C$12)","v":"さとる"}]
[null,{"$f":"IF(設定!$C$13=\"\",\"\",設定!$C$13)","v":"くるみ"},null,{"$f":"IF(設定!$C$13=\"\",\"\",設定!$C$13)","v":"くるみ"},null,{"$f":"IF(設定!$C$13=\"\",\"\",設定!$C$13)","v":"くるみ"},null,{"$f":"IF(設定!$C$13=\"\",\"\",設定!$C$13)","v":"くるみ"},null,{"$f":"IF(設定!$C$13=\"\",\"\",設定!$C$13)","v":"くるみ"},null,{"$f":"IF(設定!$C$13=\"\",\"\",設定!$C$13)","v":"くるみ"},null,{"$f":"IF(設定!$C$13=\"\",\"\",設定!$C$13)","v":"くるみ"}]
[null,{"$f":"IF(設定!$C$14=\"\",\"\",設定!$C$14)","v":"ともか"},null,{"$f":"IF(設定!$C$14=\"\",\"\",設定!$C$14)","v":"ともか"},null,{"$f":"IF(設定!$C$14=\"\",\"\",設定!$C$14)","v":"ともか"},null,{"$f":"IF(設定!$C$14=\"\",\"\",設定!$C$14)","v":"ともか"},null,{"$f":"IF(設定!$C$14=\"\",\"\",設定!$C$14)","v":"ともか"},null,{"$f":"IF(設定!$C$14=\"\",\"\",設定!$C$14)","v":"ともか"},null,{"$f":"IF(設定!$C$14=\"\",\"\",設定!$C$14)","v":"ともか"}]
[2013]
[null,{"$f":"IF(B470+1>12,1,B470+1)","v":11}]
[null,{"$f":"CHOOSE($B522,\"January\",\"February\",\"March\",\"April\",\"May\",\"June\",\"July\",\"August\",\"September\",\"October\",\"November\",\"December\")","v":"November"},null,null,{"$f":"IF(B522=1,E471+1,E471)","v":2021}]
[]
[null,{"$f":"$B$5","v":"月"},null,{"$f":"$D$5","v":"火"},null,{"$f":"$F$5","v":"水"},null,{"$f":"$H$5","v":"木"},null,{"$f":"$J$5","v":"金"},null,{"$f":"$L$5","v":"土"},null,{"$f":"$N$5","v":"日"}]
[null,{"$f":"IF(IF(B525=\"日\",1,2)>=WEEKDAY(DATE($E523,$B522,1)),IF(IF(B525=\"日\",1,2)-WEEKDAY(DATE($E523,$B522,1))+1>1,\"\",IF(B525=\"日\",1,2)-WEEKDAY(DATE($E523,$B522,1))+1),\"\")","v":1},{"$f":"IF(ISERROR(VLOOKUP(DATE($E$523,$B$522,B526),Holiday,2,FALSE)),\"\",VLOOKUP(DATE($E$523,$B$522,B526),Holiday,2,FALSE))","v":""},{"$f":"IF(IF(D525=\"月\",2,3)>=WEEKDAY(DATE($E523,$B522,1)),IF(IF(D525=\"月\",2,3)-WEEKDAY(DATE($E523,$B522,1))+1>2,\"\",IF(D525=\"月\",2,3)-WEEKDAY(DATE($E523,$B522,1))+1),\"\")","v":2},{"$f":"IF(ISERROR(VLOOKUP(DATE($E$523,$B$522,D526),Holiday,2,FALSE)),\"\",VLOOKUP(DATE($E$523,$B$522,D526),Holiday,2,FALSE))","v":""},{"$f":"IF(IF(F525=\"火\",3,4)>=WEEKDAY(DATE($E523,$B522,1)),IF(IF(F525=\"火\",3,4)-WEEKDAY(DATE($E523,$B522,1))+1>3,\"\",IF(F525=\"火\",3,4)-WEEKDAY(DATE($E523,$B522,1))+1),\"\")","v":3},{"$f":"IF(ISERROR(VLOOKUP(DATE($E$523,$B$522,F526),Holiday,2,FALSE)),\"\",VLOOKUP(DATE($E$523,$B$522,F526),Holiday,2,FALSE))","v":"文化の日"},{"$f":"IF(IF(H525=\"水\",4,5)>=WEEKDAY(DATE($E523,$B522,1)),IF(IF(H525=\"水\",4,5)-WEEKDAY(DATE($E523,$B522,1))+1>4,\"\",IF(H525=\"水\",4,5)-WEEKDAY(DATE($E523,$B522,1))+1),\"\")","v":4},{"$f":"IF(ISERROR(VLOOKUP(DATE($E$523,$B$522,H526),Holiday,2,FALSE)),\"\",VLOOKUP(DATE($E$523,$B$522,H526),Holiday,2,FALSE))","v":""},{"$f":"IF(IF(J525=\"木\",5,6)>=WEEKDAY(DATE($E523,$B522,1)),IF(IF(J525=\"木\",5,6)-WEEKDAY(DATE($E523,$B522,1))+1>5,\"\",IF(J525=\"木\",5,6)-WEEKDAY(DATE($E523,$B522,1))+1),\"\")","v":5},{"$f":"IF(ISERROR(VLOOKUP(DATE($E$523,$B$522,J526),Holiday,2,FALSE)),\"\",VLOOKUP(DATE($E$523,$B$522,J526),Holiday,2,FALSE))","v":""},{"$f":"IF(IF(L525=\"金\",6,7)>=WEEKDAY(DATE($E523,$B522,1)),IF(IF(L525=\"金\",6,7)-WEEKDAY(DATE($E523,$B522,1))+1>6,\"\",IF(L525=\"金\",6,7)-WEEKDAY(DATE($E523,$B522,1))+1),\"\")","v":6},{"$f":"IF(ISERROR(VLOOKUP(DATE($E$523,$B$522,L526),Holiday,2,FALSE)),\"\",VLOOKUP(DATE($E$523,$B$522,L526),Holiday,2,FALSE))","v":""},{"$f":"IF(L526=\"\",IF(IF(N525=\"土\",7,1)>=WEEKDAY(DATE($E523,$B522,1)),IF(N525=\"土\",7,1)-WEEKDAY(DATE($E523,$B522,1))+1),L526+1)","v":7},{"$f":"IF(ISERROR(VLOOKUP(DATE($E$523,$B$522,N526),Holiday,2,FALSE)),\"\",VLOOKUP(DATE($E$523,$B$522,N526),Holiday,2,FALSE))","v":""}]
[]
[null,{"$f":"IF(設定!$C$10=\"\",\"\",設定!$C$10)","v":"パパ"},null,{"$f":"IF(設定!$C$10=\"\",\"\",設定!$C$10)","v":"パパ"},null,{"$f":"IF(設定!$C$10=\"\",\"\",設定!$C$10)","v":"パパ"},null,{"$f":"IF(設定!$C$10=\"\",\"\",設定!$C$10)","v":"パパ"},null,{"$f":"IF(設定!$C$10=\"\",\"\",設定!$C$10)","v":"パパ"},null,{"$f":"IF(設定!$C$10=\"\",\"\",設定!$C$10)","v":"パパ"},null,{"$f":"IF(設定!$C$10=\"\",\"\",設定!$C$10)","v":"パパ"}]
[null,{"$f":"IF(設定!$C$11=\"\",\"\",設定!$C$11)","v":"ママ"},null,{"$f":"IF(設定!$C$11=\"\",\"\",設定!$C$11)","v":"ママ"},null,{"$f":"IF(設定!$C$11=\"\",\"\",設定!$C$11)","v":"ママ"},null,{"$f":"IF(設定!$C$11=\"\",\"\",設定!$C$11)","v":"ママ"},null,{"$f":"IF(設定!$C$11=\"\",\"\",設定!$C$11)","v":"ママ"},null,{"$f":"IF(設定!$C$11=\"\",\"\",設定!$C$11)","v":"ママ"},null,{"$f":"IF(設定!$C$11=\"\",\"\",設定!$C$11)","v":"ママ"}]
[null,{"$f":"IF(設定!$C$12=\"\",\"\",設定!$C$12)","v":"さとる"},null,{"$f":"IF(設定!$C$12=\"\",\"\",設定!$C$12)","v":"さとる"},null,{"$f":"IF(設定!$C$12=\"\",\"\",設定!$C$12)","v":"さとる"},null,{"$f":"IF(設定!$C$12=\"\",\"\",設定!$C$12)","v":"さとる"},null,{"$f":"IF(設定!$C$12=\"\",\"\",設定!$C$12)","v":"さとる"},null,{"$f":"IF(設定!$C$12=\"\",\"\",設定!$C$12)","v":"さとる"},null,{"$f":"IF(設定!$C$12=\"\",\"\",設定!$C$12)","v":"さとる"}]
[null,{"$f":"IF(設定!$C$13=\"\",\"\",設定!$C$13)","v":"くるみ"},null,{"$f":"IF(設定!$C$13=\"\",\"\",設定!$C$13)","v":"くるみ"},null,{"$f":"IF(設定!$C$13=\"\",\"\",設定!$C$13)","v":"くるみ"},null,{"$f":"IF(設定!$C$13=\"\",\"\",設定!$C$13)","v":"くるみ"},null,{"$f":"IF(設定!$C$13=\"\",\"\",設定!$C$13)","v":"くるみ"},null,{"$f":"IF(設定!$C$13=\"\",\"\",設定!$C$13)","v":"くるみ"},null,{"$f":"IF(設定!$C$13=\"\",\"\",設定!$C$13)","v":"くるみ"}]
[null,{"$f":"IF(設定!$C$14=\"\",\"\",設定!$C$14)","v":"ともか"},null,{"$f":"IF(設定!$C$14=\"\",\"\",設定!$C$14)","v":"ともか"},null,{"$f":"IF(設定!$C$14=\"\",\"\",設定!$C$14)","v":"ともか"},null,{"$f":"IF(設定!$C$14=\"\",\"\",設定!$C$14)","v":"ともか"},null,{"$f":"IF(設定!$C$14=\"\",\"\",設定!$C$14)","v":"ともか"},null,{"$f":"IF(設定!$C$14=\"\",\"\",設定!$C$14)","v":"ともか"},null,{"$f":"IF(設定!$C$14=\"\",\"\",設定!$C$14)","v":"ともか"}]
[null,{"$f":"$B$5","v":"月"},null,{"$f":"$D$5","v":"火"},null,{"$f":"$F$5","v":"水"},null,{"$f":"$H$5","v":"木"},null,{"$f":"$J$5","v":"金"},null,{"$f":"$L$5","v":"土"},null,{"$f":"$N$5","v":"日"}]
[null,{"$f":"$N526+1","v":8},{"$f":"IF(ISERROR(VLOOKUP(DATE($E$523,$B$522,B534),Holiday,2,FALSE)),\"\",VLOOKUP(DATE($E$523,$B$522,B534),Holiday,2,FALSE))","v":""},{"$f":"B534+1","v":9},{"$f":"IF(ISERROR(VLOOKUP(DATE($E$523,$B$522,D534),Holiday,2,FALSE)),\"\",VLOOKUP(DATE($E$523,$B$522,D534),Holiday,2,FALSE))","v":""},{"$f":"D534+1","v":10},{"$f":"IF(ISERROR(VLOOKUP(DATE($E$523,$B$522,F534),Holiday,2,FALSE)),\"\",VLOOKUP(DATE($E$523,$B$522,F534),Holiday,2,FALSE))","v":""},{"$f":"F534+1","v":11},{"$f":"IF(ISERROR(VLOOKUP(DATE($E$523,$B$522,H534),Holiday,2,FALSE)),\"\",VLOOKUP(DATE($E$523,$B$522,H534),Holiday,2,FALSE))","v":""},{"$f":"H534+1","v":12},{"$f":"IF(ISERROR(VLOOKUP(DATE($E$523,$B$522,J534),Holiday,2,FALSE)),\"\",VLOOKUP(DATE($E$523,$B$522,J534),Holiday,2,FALSE))","v":""},{"$f":"J534+1","v":13},{"$f":"IF(ISERROR(VLOOKUP(DATE($E$523,$B$522,L534),Holiday,2,FALSE)),\"\",VLOOKUP(DATE($E$523,$B$522,L534),Holiday,2,FALSE))","v":""},{"$f":"L534+1","v":14},{"$f":"IF(ISERROR(VLOOKUP(DATE($E$523,$B$522,N534),Holiday,2,FALSE)),\"\",VLOOKUP(DATE($E$523,$B$522,N534),Holiday,2,FALSE))","v":""}]
[]
[null,{"$f":"IF(設定!$C$10=\"\",\"\",設定!$C$10)","v":"パパ"},null,{"$f":"IF(設定!$C$10=\"\",\"\",設定!$C$10)","v":"パパ"},null,{"$f":"IF(設定!$C$10=\"\",\"\",設定!$C$10)","v":"パパ"},null,{"$f":"IF(設定!$C$10=\"\",\"\",設定!$C$10)","v":"パパ"},null,{"$f":"IF(設定!$C$10=\"\",\"\",設定!$C$10)","v":"パパ"},null,{"$f":"IF(設定!$C$10=\"\",\"\",設定!$C$10)","v":"パパ"},null,{"$f":"IF(設定!$C$10=\"\",\"\",設定!$C$10)","v":"パパ"}]
[null,{"$f":"IF(設定!$C$11=\"\",\"\",設定!$C$11)","v":"ママ"},null,{"$f":"IF(設定!$C$11=\"\",\"\",設定!$C$11)","v":"ママ"},null,{"$f":"IF(設定!$C$11=\"\",\"\",設定!$C$11)","v":"ママ"},null,{"$f":"IF(設定!$C$11=\"\",\"\",設定!$C$11)","v":"ママ"},null,{"$f":"IF(設定!$C$11=\"\",\"\",設定!$C$11)","v":"ママ"},null,{"$f":"IF(設定!$C$11=\"\",\"\",設定!$C$11)","v":"ママ"},null,{"$f":"IF(設定!$C$11=\"\",\"\",設定!$C$11)","v":"ママ"}]
[null,{"$f":"IF(設定!$C$12=\"\",\"\",設定!$C$12)","v":"さとる"},null,{"$f":"IF(設定!$C$12=\"\",\"\",設定!$C$12)","v":"さとる"},null,{"$f":"IF(設定!$C$12=\"\",\"\",設定!$C$12)","v":"さとる"},null,{"$f":"IF(設定!$C$12=\"\",\"\",設定!$C$12)","v":"さとる"},null,{"$f":"IF(設定!$C$12=\"\",\"\",設定!$C$12)","v":"さとる"},null,{"$f":"IF(設定!$C$12=\"\",\"\",設定!$C$12)","v":"さとる"},null,{"$f":"IF(設定!$C$12=\"\",\"\",設定!$C$12)","v":"さとる"}]
[null,{"$f":"IF(設定!$C$13=\"\",\"\",設定!$C$13)","v":"くるみ"},null,{"$f":"IF(設定!$C$13=\"\",\"\",設定!$C$13)","v":"くるみ"},null,{"$f":"IF(設定!$C$13=\"\",\"\",設定!$C$13)","v":"くるみ"},null,{"$f":"IF(設定!$C$13=\"\",\"\",設定!$C$13)","v":"くるみ"},null,{"$f":"IF(設定!$C$13=\"\",\"\",設定!$C$13)","v":"くるみ"},null,{"$f":"IF(設定!$C$13=\"\",\"\",設定!$C$13)","v":"くるみ"},null,{"$f":"IF(設定!$C$13=\"\",\"\",設定!$C$13)","v":"くるみ"}]
[null,{"$f":"IF(設定!$C$14=\"\",\"\",設定!$C$14)","v":"ともか"},null,{"$f":"IF(設定!$C$14=\"\",\"\",設定!$C$14)","v":"ともか"},null,{"$f":"IF(設定!$C$14=\"\",\"\",設定!$C$14)","v":"ともか"},null,{"$f":"IF(設定!$C$14=\"\",\"\",設定!$C$14)","v":"ともか"},null,{"$f":"IF(設定!$C$14=\"\",\"\",設定!$C$14)","v":"ともか"},null,{"$f":"IF(設定!$C$14=\"\",\"\",設定!$C$14)","v":"ともか"},null,{"$f":"IF(設定!$C$14=\"\",\"\",設定!$C$14)","v":"ともか"}]
[null,{"$f":"$B$5","v":"月"},null,{"$f":"$D$5","v":"火"},null,{"$f":"$F$5","v":"水"},null,{"$f":"$H$5","v":"木"},null,{"$f":"$J$5","v":"金"},null,{"$f":"$L$5","v":"土"},null,{"$f":"$N$5","v":"日"}]
[null,{"$f":"$N534+1","v":15},{"$f":"IF(ISERROR(VLOOKUP(DATE($E$523,$B$522,B542),Holiday,2,FALSE)),\"\",VLOOKUP(DATE($E$523,$B$522,B542),Holiday,2,FALSE))","v":""},{"$f":"B542+1","v":16},{"$f":"IF(ISERROR(VLOOKUP(DATE($E$523,$B$522,D542),Holiday,2,FALSE)),\"\",VLOOKUP(DATE($E$523,$B$522,D542),Holiday,2,FALSE))","v":""},{"$f":"D542+1","v":17},{"$f":"IF(ISERROR(VLOOKUP(DATE($E$523,$B$522,F542),Holiday,2,FALSE)),\"\",VLOOKUP(DATE($E$523,$B$522,F542),Holiday,2,FALSE))","v":""},{"$f":"F542+1","v":18},{"$f":"IF(ISERROR(VLOOKUP(DATE($E$523,$B$522,H542),Holiday,2,FALSE)),\"\",VLOOKUP(DATE($E$523,$B$522,H542),Holiday,2,FALSE))","v":""},{"$f":"H542+1","v":19},{"$f":"IF(ISERROR(VLOOKUP(DATE($E$523,$B$522,J542),Holiday,2,FALSE)),\"\",VLOOKUP(DATE($E$523,$B$522,J542),Holiday,2,FALSE))","v":""},{"$f":"J542+1","v":20},{"$f":"IF(ISERROR(VLOOKUP(DATE($E$523,$B$522,L542),Holiday,2,FALSE)),\"\",VLOOKUP(DATE($E$523,$B$522,L542),Holiday,2,FALSE))","v":""},{"$f":"L542+1","v":21},{"$f":"IF(ISERROR(VLOOKUP(DATE($E$523,$B$522,N542),Holiday,2,FALSE)),\"\",VLOOKUP(DATE($E$523,$B$522,N542),Holiday,2,FALSE))","v":""}]
[]
[null,{"$f":"IF(設定!$C$10=\"\",\"\",設定!$C$10)","v":"パパ"},null,{"$f":"IF(設定!$C$10=\"\",\"\",設定!$C$10)","v":"パパ"},null,{"$f":"IF(設定!$C$10=\"\",\"\",設定!$C$10)","v":"パパ"},null,{"$f":"IF(設定!$C$10=\"\",\"\",設定!$C$10)","v":"パパ"},null,{"$f":"IF(設定!$C$10=\"\",\"\",設定!$C$10)","v":"パパ"},null,{"$f":"IF(設定!$C$10=\"\",\"\",設定!$C$10)","v":"パパ"},null,{"$f":"IF(設定!$C$10=\"\",\"\",設定!$C$10)","v":"パパ"}]
[null,{"$f":"IF(設定!$C$11=\"\",\"\",設定!$C$11)","v":"ママ"},null,{"$f":"IF(設定!$C$11=\"\",\"\",設定!$C$11)","v":"ママ"},null,{"$f":"IF(設定!$C$11=\"\",\"\",設定!$C$11)","v":"ママ"},null,{"$f":"IF(設定!$C$11=\"\",\"\",設定!$C$11)","v":"ママ"},null,{"$f":"IF(設定!$C$11=\"\",\"\",設定!$C$11)","v":"ママ"},null,{"$f":"IF(設定!$C$11=\"\",\"\",設定!$C$11)","v":"ママ"},null,{"$f":"IF(設定!$C$11=\"\",\"\",設定!$C$11)","v":"ママ"}]
[null,{"$f":"IF(設定!$C$12=\"\",\"\",設定!$C$12)","v":"さとる"},null,{"$f":"IF(設定!$C$12=\"\",\"\",設定!$C$12)","v":"さとる"},null,{"$f":"IF(設定!$C$12=\"\",\"\",設定!$C$12)","v":"さとる"},null,{"$f":"IF(設定!$C$12=\"\",\"\",設定!$C$12)","v":"さとる"},null,{"$f":"IF(設定!$C$12=\"\",\"\",設定!$C$12)","v":"さとる"},null,{"$f":"IF(設定!$C$12=\"\",\"\",設定!$C$12)","v":"さとる"},null,{"$f":"IF(設定!$C$12=\"\",\"\",設定!$C$12)","v":"さとる"}]
[null,{"$f":"IF(設定!$C$13=\"\",\"\",設定!$C$13)","v":"くるみ"},null,{"$f":"IF(設定!$C$13=\"\",\"\",設定!$C$13)","v":"くるみ"},null,{"$f":"IF(設定!$C$13=\"\",\"\",設定!$C$13)","v":"くるみ"},null,{"$f":"IF(設定!$C$13=\"\",\"\",設定!$C$13)","v":"くるみ"},null,{"$f":"IF(設定!$C$13=\"\",\"\",設定!$C$13)","v":"くるみ"},null,{"$f":"IF(設定!$C$13=\"\",\"\",設定!$C$13)","v":"くるみ"},null,{"$f":"IF(設定!$C$13=\"\",\"\",設定!$C$13)","v":"くるみ"}]
[null,{"$f":"IF(設定!$C$14=\"\",\"\",設定!$C$14)","v":"ともか"},null,{"$f":"IF(設定!$C$14=\"\",\"\",設定!$C$14)","v":"ともか"},null,{"$f":"IF(設定!$C$14=\"\",\"\",設定!$C$14)","v":"ともか"},null,{"$f":"IF(設定!$C$14=\"\",\"\",設定!$C$14)","v":"ともか"},null,{"$f":"IF(設定!$C$14=\"\",\"\",設定!$C$14)","v":"ともか"},null,{"$f":"IF(設定!$C$14=\"\",\"\",設定!$C$14)","v":"ともか"},null,{"$f":"IF(設定!$C$14=\"\",\"\",設定!$C$14)","v":"ともか"}]
[null,{"$f":"$B$5","v":"月"},null,{"$f":"$D$5","v":"火"},null,{"$f":"$F$5","v":"水"},null,{"$f":"$H$5","v":"木"},null,{"$f":"$J$5","v":"金"},null,{"$f":"$L$5","v":"土"},null,{"$f":"$N$5","v":"日"}]
[null,{"$f":"$N542+1","v":22},{"$f":"IF(ISERROR(VLOOKUP(DATE($E$523,$B$522,B550),Holiday,2,FALSE)),\"\",VLOOKUP(DATE($E$523,$B$522,B550),Holiday,2,FALSE))","v":""},{"$f":"B550+1","v":23},{"$f":"IF(ISERROR(VLOOKUP(DATE($E$523,$B$522,D550),Holiday,2,FALSE)),\"\",VLOOKUP(DATE($E$523,$B$522,D550),Holiday,2,FALSE))","v":"勤労感謝の日"},{"$f":"D550+1","v":24},{"$f":"IF(ISERROR(VLOOKUP(DATE($E$523,$B$522,F550),Holiday,2,FALSE)),\"\",VLOOKUP(DATE($E$523,$B$522,F550),Holiday,2,FALSE))","v":""},{"$f":"F550+1","v":25},{"$f":"IF(ISERROR(VLOOKUP(DATE($E$523,$B$522,H550),Holiday,2,FALSE)),\"\",VLOOKUP(DATE($E$523,$B$522,H550),Holiday,2,FALSE))","v":""},{"$f":"H550+1","v":26},{"$f":"IF(ISERROR(VLOOKUP(DATE($E$523,$B$522,J550),Holiday,2,FALSE)),\"\",VLOOKUP(DATE($E$523,$B$522,J550),Holiday,2,FALSE))","v":""},{"$f":"J550+1","v":27},{"$f":"IF(ISERROR(VLOOKUP(DATE($E$523,$B$522,L550),Holiday,2,FALSE)),\"\",VLOOKUP(DATE($E$523,$B$522,L550),Holiday,2,FALSE))","v":""},{"$f":"L550+1","v":28},{"$f":"IF(ISERROR(VLOOKUP(DATE($E$523,$B$522,N550),Holiday,2,FALSE)),\"\",VLOOKUP(DATE($E$523,$B$522,N550),Holiday,2,FALSE))","v":""}]
[]
[null,{"$f":"IF(設定!$C$10=\"\",\"\",設定!$C$10)","v":"パパ"},null,{"$f":"IF(設定!$C$10=\"\",\"\",設定!$C$10)","v":"パパ"},null,{"$f":"IF(設定!$C$10=\"\",\"\",設定!$C$10)","v":"パパ"},null,{"$f":"IF(設定!$C$10=\"\",\"\",設定!$C$10)","v":"パパ"},null,{"$f":"IF(設定!$C$10=\"\",\"\",設定!$C$10)","v":"パパ"},null,{"$f":"IF(設定!$C$10=\"\",\"\",設定!$C$10)","v":"パパ"},null,{"$f":"IF(設定!$C$10=\"\",\"\",設定!$C$10)","v":"パパ"}]
[null,{"$f":"IF(設定!$C$11=\"\",\"\",設定!$C$11)","v":"ママ"},null,{"$f":"IF(設定!$C$11=\"\",\"\",設定!$C$11)","v":"ママ"},null,{"$f":"IF(設定!$C$11=\"\",\"\",設定!$C$11)","v":"ママ"},null,{"$f":"IF(設定!$C$11=\"\",\"\",設定!$C$11)","v":"ママ"},null,{"$f":"IF(設定!$C$11=\"\",\"\",設定!$C$11)","v":"ママ"},null,{"$f":"IF(設定!$C$11=\"\",\"\",設定!$C$11)","v":"ママ"},null,{"$f":"IF(設定!$C$11=\"\",\"\",設定!$C$11)","v":"ママ"}]
[null,{"$f":"IF(設定!$C$12=\"\",\"\",設定!$C$12)","v":"さとる"},null,{"$f":"IF(設定!$C$12=\"\",\"\",設定!$C$12)","v":"さとる"},null,{"$f":"IF(設定!$C$12=\"\",\"\",設定!$C$12)","v":"さとる"},null,{"$f":"IF(設定!$C$12=\"\",\"\",設定!$C$12)","v":"さとる"},null,{"$f":"IF(設定!$C$12=\"\",\"\",設定!$C$12)","v":"さとる"},null,{"$f":"IF(設定!$C$12=\"\",\"\",設定!$C$12)","v":"さとる"},null,{"$f":"IF(設定!$C$12=\"\",\"\",設定!$C$12)","v":"さとる"}]
[null,{"$f":"IF(設定!$C$13=\"\",\"\",設定!$C$13)","v":"くるみ"},null,{"$f":"IF(設定!$C$13=\"\",\"\",設定!$C$13)","v":"くるみ"},null,{"$f":"IF(設定!$C$13=\"\",\"\",設定!$C$13)","v":"くるみ"},null,{"$f":"IF(設定!$C$13=\"\",\"\",設定!$C$13)","v":"くるみ"},null,{"$f":"IF(設定!$C$13=\"\",\"\",設定!$C$13)","v":"くるみ"},null,{"$f":"IF(設定!$C$13=\"\",\"\",設定!$C$13)","v":"くるみ"},null,{"$f":"IF(設定!$C$13=\"\",\"\",設定!$C$13)","v":"くるみ"}]
[null,{"$f":"IF(設定!$C$14=\"\",\"\",設定!$C$14)","v":"ともか"},null,{"$f":"IF(設定!$C$14=\"\",\"\",設定!$C$14)","v":"ともか"},null,{"$f":"IF(設定!$C$14=\"\",\"\",設定!$C$14)","v":"ともか"},null,{"$f":"IF(設定!$C$14=\"\",\"\",設定!$C$14)","v":"ともか"},null,{"$f":"IF(設定!$C$14=\"\",\"\",設定!$C$14)","v":"ともか"},null,{"$f":"IF(設定!$C$14=\"\",\"\",設定!$C$14)","v":"ともか"},null,{"$f":"IF(設定!$C$14=\"\",\"\",設定!$C$14)","v":"ともか"}]
[null,{"$f":"$B$5","v":"月"},null,{"$f":"$D$5","v":"火"},null,{"$f":"$F$5","v":"水"},null,{"$f":"$H$5","v":"木"},null,{"$f":"$J$5","v":"金"},null,{"$f":"$L$5","v":"土"},null,{"$f":"$N$5","v":"日"}]
[null,{"$f":"$N550+1","v":29},{"$f":"IF(ISERROR(VLOOKUP(DATE($E$523,$B$522,B558),Holiday,2,FALSE)),\"\",VLOOKUP(DATE($E$523,$B$522,B558),Holiday,2,FALSE))","v":""},{"$f":"B558+1","v":30},{"$f":"IF(ISERROR(VLOOKUP(DATE($E$523,$B$522,D558),Holiday,2,FALSE)),\"\",VLOOKUP(DATE($E$523,$B$522,D558),Holiday,2,FALSE))","v":""},{"$f":"D558+1","v":31},{"$f":"IF(ISERROR(VLOOKUP(DATE($E$523,$B$522,F558),Holiday,2,FALSE)),\"\",VLOOKUP(DATE($E$523,$B$522,F558),Holiday,2,FALSE))","v":""},{"$f":"F558+1","v":32},{"$f":"IF(ISERROR(VLOOKUP(DATE($E$523,$B$522,H558),Holiday,2,FALSE)),\"\",VLOOKUP(DATE($E$523,$B$522,H558),Holiday,2,FALSE))","v":""},{"$f":"H558+1","v":33},{"$f":"IF(ISERROR(VLOOKUP(DATE($E$523,$B$522,J558),Holiday,2,FALSE)),\"\",VLOOKUP(DATE($E$523,$B$522,J558),Holiday,2,FALSE))","v":""},{"$f":"J558+1","v":34},{"$f":"IF(ISERROR(VLOOKUP(DATE($E$523,$B$522,L558),Holiday,2,FALSE)),\"\",VLOOKUP(DATE($E$523,$B$522,L558),Holiday,2,FALSE))","v":""},{"$f":"L558+1","v":35},{"$f":"IF(ISERROR(VLOOKUP(DATE($E$523,$B$522,N558),Holiday,2,FALSE)),\"\",VLOOKUP(DATE($E$523,$B$522,N558),Holiday,2,FALSE))","v":""}]
[]
[null,{"$f":"IF(設定!$C$10=\"\",\"\",設定!$C$10)","v":"パパ"},null,{"$f":"IF(設定!$C$10=\"\",\"\",設定!$C$10)","v":"パパ"},null,{"$f":"IF(設定!$C$10=\"\",\"\",設定!$C$10)","v":"パパ"},null,{"$f":"IF(設定!$C$10=\"\",\"\",設定!$C$10)","v":"パパ"},null,{"$f":"IF(設定!$C$10=\"\",\"\",設定!$C$10)","v":"パパ"},null,{"$f":"IF(設定!$C$10=\"\",\"\",設定!$C$10)","v":"パパ"},null,{"$f":"IF(設定!$C$10=\"\",\"\",設定!$C$10)","v":"パパ"}]
[null,{"$f":"IF(設定!$C$11=\"\",\"\",設定!$C$11)","v":"ママ"},null,{"$f":"IF(設定!$C$11=\"\",\"\",設定!$C$11)","v":"ママ"},null,{"$f":"IF(設定!$C$11=\"\",\"\",設定!$C$11)","v":"ママ"},null,{"$f":"IF(設定!$C$11=\"\",\"\",設定!$C$11)","v":"ママ"},null,{"$f":"IF(設定!$C$11=\"\",\"\",設定!$C$11)","v":"ママ"},null,{"$f":"IF(設定!$C$11=\"\",\"\",設定!$C$11)","v":"ママ"},null,{"$f":"IF(設定!$C$11=\"\",\"\",設定!$C$11)","v":"ママ"}]
[null,{"$f":"IF(設定!$C$12=\"\",\"\",設定!$C$12)","v":"さとる"},null,{"$f":"IF(設定!$C$12=\"\",\"\",設定!$C$12)","v":"さとる"},null,{"$f":"IF(設定!$C$12=\"\",\"\",設定!$C$12)","v":"さとる"},null,{"$f":"IF(設定!$C$12=\"\",\"\",設定!$C$12)","v":"さとる"},null,{"$f":"IF(設定!$C$12=\"\",\"\",設定!$C$12)","v":"さとる"},null,{"$f":"IF(設定!$C$12=\"\",\"\",設定!$C$12)","v":"さとる"},null,{"$f":"IF(設定!$C$12=\"\",\"\",設定!$C$12)","v":"さとる"}]
[null,{"$f":"IF(設定!$C$13=\"\",\"\",設定!$C$13)","v":"くるみ"},null,{"$f":"IF(設定!$C$13=\"\",\"\",設定!$C$13)","v":"くるみ"},null,{"$f":"IF(設定!$C$13=\"\",\"\",設定!$C$13)","v":"くるみ"},null,{"$f":"IF(設定!$C$13=\"\",\"\",設定!$C$13)","v":"くるみ"},null,{"$f":"IF(設定!$C$13=\"\",\"\",設定!$C$13)","v":"くるみ"},null,{"$f":"IF(設定!$C$13=\"\",\"\",設定!$C$13)","v":"くるみ"},null,{"$f":"IF(設定!$C$13=\"\",\"\",設定!$C$13)","v":"くるみ"}]
[null,{"$f":"IF(設定!$C$14=\"\",\"\",設定!$C$14)","v":"ともか"},null,{"$f":"IF(設定!$C$14=\"\",\"\",設定!$C$14)","v":"ともか"},null,{"$f":"IF(設定!$C$14=\"\",\"\",設定!$C$14)","v":"ともか"},null,{"$f":"IF(設定!$C$14=\"\",\"\",設定!$C$14)","v":"ともか"},null,{"$f":"IF(設定!$C$14=\"\",\"\",設定!$C$14)","v":"ともか"},null,{"$f":"IF(設定!$C$14=\"\",\"\",設定!$C$14)","v":"ともか"},null,{"$f":"IF(設定!$C$14=\"\",\"\",設定!$C$14)","v":"ともか"}]
[null,{"$f":"$B$5","v":"月"},null,{"$f":"$D$5","v":"火"},null,{"$f":"$F$5","v":"水"},null,{"$f":"$H$5","v":"木"},null,{"$f":"$J$5","v":"金"},null,{"$f":"$L$5","v":"土"},null,{"$f":"$N$5","v":"日"}]
[null,{"$f":"$N558+1","v":36},{"$f":"IF(ISERROR(VLOOKUP(DATE($E$523,$B$522,B566),Holiday,2,FALSE)),\"\",VLOOKUP(DATE($E$523,$B$522,B566),Holiday,2,FALSE))","v":""},{"$f":"B566+1","v":37},{"$f":"IF(ISERROR(VLOOKUP(DATE($E$523,$B$522,D566),Holiday,2,FALSE)),\"\",VLOOKUP(DATE($E$523,$B$522,D566),Holiday,2,FALSE))","v":""},{"$f":"D566+1","v":38},{"$f":"IF(ISERROR(VLOOKUP(DATE($E$523,$B$522,F566),Holiday,2,FALSE)),\"\",VLOOKUP(DATE($E$523,$B$522,F566),Holiday,2,FALSE))","v":""},{"$f":"F566+1","v":39},{"$f":"IF(ISERROR(VLOOKUP(DATE($E$523,$B$522,H566),Holiday,2,FALSE)),\"\",VLOOKUP(DATE($E$523,$B$522,H566),Holiday,2,FALSE))","v":""},{"$f":"H566+1","v":40},{"$f":"IF(ISERROR(VLOOKUP(DATE($E$523,$B$522,J566),Holiday,2,FALSE)),\"\",VLOOKUP(DATE($E$523,$B$522,J566),Holiday,2,FALSE))","v":""},{"$f":"J566+1","v":41},{"$f":"IF(ISERROR(VLOOKUP(DATE($E$523,$B$522,L566),Holiday,2,FALSE)),\"\",VLOOKUP(DATE($E$523,$B$522,L566),Holiday,2,FALSE))","v":""},{"$f":"L566+1","v":42},{"$f":"IF(ISERROR(VLOOKUP(DATE($E$523,$B$522,N566),Holiday,2,FALSE)),\"\",VLOOKUP(DATE($E$523,$B$522,N566),Holiday,2,FALSE))","v":""}]
[]
[null,{"$f":"IF(設定!$C$10=\"\",\"\",設定!$C$10)","v":"パパ"},null,{"$f":"IF(設定!$C$10=\"\",\"\",設定!$C$10)","v":"パパ"},null,{"$f":"IF(設定!$C$10=\"\",\"\",設定!$C$10)","v":"パパ"},null,{"$f":"IF(設定!$C$10=\"\",\"\",設定!$C$10)","v":"パパ"},null,{"$f":"IF(設定!$C$10=\"\",\"\",設定!$C$10)","v":"パパ"},null,{"$f":"IF(設定!$C$10=\"\",\"\",設定!$C$10)","v":"パパ"},null,{"$f":"IF(設定!$C$10=\"\",\"\",設定!$C$10)","v":"パパ"}]
[null,{"$f":"IF(設定!$C$11=\"\",\"\",設定!$C$11)","v":"ママ"},null,{"$f":"IF(設定!$C$11=\"\",\"\",設定!$C$11)","v":"ママ"},null,{"$f":"IF(設定!$C$11=\"\",\"\",設定!$C$11)","v":"ママ"},null,{"$f":"IF(設定!$C$11=\"\",\"\",設定!$C$11)","v":"ママ"},null,{"$f":"IF(設定!$C$11=\"\",\"\",設定!$C$11)","v":"ママ"},null,{"$f":"IF(設定!$C$11=\"\",\"\",設定!$C$11)","v":"ママ"},null,{"$f":"IF(設定!$C$11=\"\",\"\",設定!$C$11)","v":"ママ"}]
[null,{"$f":"IF(設定!$C$12=\"\",\"\",設定!$C$12)","v":"さとる"},null,{"$f":"IF(設定!$C$12=\"\",\"\",設定!$C$12)","v":"さとる"},null,{"$f":"IF(設定!$C$12=\"\",\"\",設定!$C$12)","v":"さとる"},null,{"$f":"IF(設定!$C$12=\"\",\"\",設定!$C$12)","v":"さとる"},null,{"$f":"IF(設定!$C$12=\"\",\"\",設定!$C$12)","v":"さとる"},null,{"$f":"IF(設定!$C$12=\"\",\"\",設定!$C$12)","v":"さとる"},null,{"$f":"IF(設定!$C$12=\"\",\"\",設定!$C$12)","v":"さとる"}]
[null,{"$f":"IF(設定!$C$13=\"\",\"\",設定!$C$13)","v":"くるみ"},null,{"$f":"IF(設定!$C$13=\"\",\"\",設定!$C$13)","v":"くるみ"},null,{"$f":"IF(設定!$C$13=\"\",\"\",設定!$C$13)","v":"くるみ"},null,{"$f":"IF(設定!$C$13=\"\",\"\",設定!$C$13)","v":"くるみ"},null,{"$f":"IF(設定!$C$13=\"\",\"\",設定!$C$13)","v":"くるみ"},null,{"$f":"IF(設定!$C$13=\"\",\"\",設定!$C$13)","v":"くるみ"},null,{"$f":"IF(設定!$C$13=\"\",\"\",設定!$C$13)","v":"くるみ"}]
[null,{"$f":"IF(設定!$C$14=\"\",\"\",設定!$C$14)","v":"ともか"},null,{"$f":"IF(設定!$C$14=\"\",\"\",設定!$C$14)","v":"ともか"},null,{"$f":"IF(設定!$C$14=\"\",\"\",設定!$C$14)","v":"ともか"},null,{"$f":"IF(設定!$C$14=\"\",\"\",設定!$C$14)","v":"ともか"},null,{"$f":"IF(設定!$C$14=\"\",\"\",設定!$C$14)","v":"ともか"},null,{"$f":"IF(設定!$C$14=\"\",\"\",設定!$C$14)","v":"ともか"},null,{"$f":"IF(設定!$C$14=\"\",\"\",設定!$C$14)","v":"ともか"}]
[2013]
[null,{"$f":"IF(B522+1>12,1,B522+1)","v":12}]
[null,{"$f":"CHOOSE($B574,\"January\",\"February\",\"March\",\"April\",\"May\",\"June\",\"July\",\"August\",\"September\",\"October\",\"November\",\"December\")","v":"December"},null,null,{"$f":"IF(B574=1,E523+1,E523)","v":2021}]
[]
[null,{"$f":"$B$5","v":"月"},null,{"$f":"$D$5","v":"火"},null,{"$f":"$F$5","v":"水"},null,{"$f":"$H$5","v":"木"},null,{"$f":"$J$5","v":"金"},null,{"$f":"$L$5","v":"土"},null,{"$f":"$N$5","v":"日"}]
[null,{"$f":"IF(IF(B577=\"日\",1,2)>=WEEKDAY(DATE($E575,$B574,1)),IF(IF(B577=\"日\",1,2)-WEEKDAY(DATE($E575,$B574,1))+1>1,\"\",IF(B577=\"日\",1,2)-WEEKDAY(DATE($E575,$B574,1))+1),\"\")","v":""},{"$f":"IF(ISERROR(VLOOKUP(DATE($E$575,$B$574,B578),Holiday,2,FALSE)),\"\",VLOOKUP(DATE($E$575,$B$574,B578),Holiday,2,FALSE))","v":""},{"$f":"IF(IF(D577=\"月\",2,3)>=WEEKDAY(DATE($E575,$B574,1)),IF(IF(D577=\"月\",2,3)-WEEKDAY(DATE($E575,$B574,1))+1>2,\"\",IF(D577=\"月\",2,3)-WEEKDAY(DATE($E575,$B574,1))+1),\"\")","v":""},{"$f":"IF(ISERROR(VLOOKUP(DATE($E$575,$B$574,D578),Holiday,2,FALSE)),\"\",VLOOKUP(DATE($E$575,$B$574,D578),Holiday,2,FALSE))","v":""},{"$f":"IF(IF(F577=\"火\",3,4)>=WEEKDAY(DATE($E575,$B574,1)),IF(IF(F577=\"火\",3,4)-WEEKDAY(DATE($E575,$B574,1))+1>3,\"\",IF(F577=\"火\",3,4)-WEEKDAY(DATE($E575,$B574,1))+1),\"\")","v":1},{"$f":"IF(ISERROR(VLOOKUP(DATE($E$575,$B$574,F578),Holiday,2,FALSE)),\"\",VLOOKUP(DATE($E$575,$B$574,F578),Holiday,2,FALSE))","v":""},{"$f":"IF(IF(H577=\"水\",4,5)>=WEEKDAY(DATE($E575,$B574,1)),IF(IF(H577=\"水\",4,5)-WEEKDAY(DATE($E575,$B574,1))+1>4,\"\",IF(H577=\"水\",4,5)-WEEKDAY(DATE($E575,$B574,1))+1),\"\")","v":2},{"$f":"IF(ISERROR(VLOOKUP(DATE($E$575,$B$574,H578),Holiday,2,FALSE)),\"\",VLOOKUP(DATE($E$575,$B$574,H578),Holiday,2,FALSE))","v":""},{"$f":"IF(IF(J577=\"木\",5,6)>=WEEKDAY(DATE($E575,$B574,1)),IF(IF(J577=\"木\",5,6)-WEEKDAY(DATE($E575,$B574,1))+1>5,\"\",IF(J577=\"木\",5,6)-WEEKDAY(DATE($E575,$B574,1))+1),\"\")","v":3},{"$f":"IF(ISERROR(VLOOKUP(DATE($E$575,$B$574,J578),Holiday,2,FALSE)),\"\",VLOOKUP(DATE($E$575,$B$574,J578),Holiday,2,FALSE))","v":""},{"$f":"IF(IF(L577=\"金\",6,7)>=WEEKDAY(DATE($E575,$B574,1)),IF(IF(L577=\"金\",6,7)-WEEKDAY(DATE($E575,$B574,1))+1>6,\"\",IF(L577=\"金\",6,7)-WEEKDAY(DATE($E575,$B574,1))+1),\"\")","v":4},{"$f":"IF(ISERROR(VLOOKUP(DATE($E$575,$B$574,L578),Holiday,2,FALSE)),\"\",VLOOKUP(DATE($E$575,$B$574,L578),Holiday,2,FALSE))","v":""},{"$f":"IF(L578=\"\",IF(IF(N577=\"土\",7,1)>=WEEKDAY(DATE($E575,$B574,1)),IF(N577=\"土\",7,1)-WEEKDAY(DATE($E575,$B574,1))+1),L578+1)","v":5},{"$f":"IF(ISERROR(VLOOKUP(DATE($E$575,$B$574,N578),Holiday,2,FALSE)),\"\",VLOOKUP(DATE($E$575,$B$574,N578),Holiday,2,FALSE))","v":""}]
[]
[null,{"$f":"IF(設定!$C$10=\"\",\"\",設定!$C$10)","v":"パパ"},null,{"$f":"IF(設定!$C$10=\"\",\"\",設定!$C$10)","v":"パパ"},null,{"$f":"IF(設定!$C$10=\"\",\"\",設定!$C$10)","v":"パパ"},null,{"$f":"IF(設定!$C$10=\"\",\"\",設定!$C$10)","v":"パパ"},null,{"$f":"IF(設定!$C$10=\"\",\"\",設定!$C$10)","v":"パパ"},null,{"$f":"IF(設定!$C$10=\"\",\"\",設定!$C$10)","v":"パパ"},null,{"$f":"IF(設定!$C$10=\"\",\"\",設定!$C$10)","v":"パパ"}]
[null,{"$f":"IF(設定!$C$11=\"\",\"\",設定!$C$11)","v":"ママ"},null,{"$f":"IF(設定!$C$11=\"\",\"\",設定!$C$11)","v":"ママ"},null,{"$f":"IF(設定!$C$11=\"\",\"\",設定!$C$11)","v":"ママ"},null,{"$f":"IF(設定!$C$11=\"\",\"\",設定!$C$11)","v":"ママ"},null,{"$f":"IF(設定!$C$11=\"\",\"\",設定!$C$11)","v":"ママ"},null,{"$f":"IF(設定!$C$11=\"\",\"\",設定!$C$11)","v":"ママ"},null,{"$f":"IF(設定!$C$11=\"\",\"\",設定!$C$11)","v":"ママ"}]
[null,{"$f":"IF(設定!$C$12=\"\",\"\",設定!$C$12)","v":"さとる"},null,{"$f":"IF(設定!$C$12=\"\",\"\",設定!$C$12)","v":"さとる"},null,{"$f":"IF(設定!$C$12=\"\",\"\",設定!$C$12)","v":"さとる"},null,{"$f":"IF(設定!$C$12=\"\",\"\",設定!$C$12)","v":"さとる"},null,{"$f":"IF(設定!$C$12=\"\",\"\",設定!$C$12)","v":"さとる"},null,{"$f":"IF(設定!$C$12=\"\",\"\",設定!$C$12)","v":"さとる"},null,{"$f":"IF(設定!$C$12=\"\",\"\",設定!$C$12)","v":"さとる"}]
[null,{"$f":"IF(設定!$C$13=\"\",\"\",設定!$C$13)","v":"くるみ"},null,{"$f":"IF(設定!$C$13=\"\",\"\",設定!$C$13)","v":"くるみ"},null,{"$f":"IF(設定!$C$13=\"\",\"\",設定!$C$13)","v":"くるみ"},null,{"$f":"IF(設定!$C$13=\"\",\"\",設定!$C$13)","v":"くるみ"},null,{"$f":"IF(設定!$C$13=\"\",\"\",設定!$C$13)","v":"くるみ"},null,{"$f":"IF(設定!$C$13=\"\",\"\",設定!$C$13)","v":"くるみ"},null,{"$f":"IF(設定!$C$13=\"\",\"\",設定!$C$13)","v":"くるみ"}]
[null,{"$f":"IF(設定!$C$14=\"\",\"\",設定!$C$14)","v":"ともか"},null,{"$f":"IF(設定!$C$14=\"\",\"\",設定!$C$14)","v":"ともか"},null,{"$f":"IF(設定!$C$14=\"\",\"\",設定!$C$14)","v":"ともか"},null,{"$f":"IF(設定!$C$14=\"\",\"\",設定!$C$14)","v":"ともか"},null,{"$f":"IF(設定!$C$14=\"\",\"\",設定!$C$14)","v":"ともか"},null,{"$f":"IF(設定!$C$14=\"\",\"\",設定!$C$14)","v":"ともか"},null,{"$f":"IF(設定!$C$14=\"\",\"\",設定!$C$14)","v":"ともか"}]
[null,{"$f":"$B$5","v":"月"},null,{"$f":"$D$5","v":"火"},null,{"$f":"$F$5","v":"水"},null,{"$f":"$H$5","v":"木"},null,{"$f":"$J$5","v":"金"},null,{"$f":"$L$5","v":"土"},null,{"$f":"$N$5","v":"日"}]
[null,{"$f":"$N578+1","v":6},{"$f":"IF(ISERROR(VLOOKUP(DATE($E$575,$B$574,B586),Holiday,2,FALSE)),\"\",VLOOKUP(DATE($E$575,$B$574,B586),Holiday,2,FALSE))","v":""},{"$f":"B586+1","v":7},{"$f":"IF(ISERROR(VLOOKUP(DATE($E$575,$B$574,D586),Holiday,2,FALSE)),\"\",VLOOKUP(DATE($E$575,$B$574,D586),Holiday,2,FALSE))","v":""},{"$f":"D586+1","v":8},{"$f":"IF(ISERROR(VLOOKUP(DATE($E$575,$B$574,F586),Holiday,2,FALSE)),\"\",VLOOKUP(DATE($E$575,$B$574,F586),Holiday,2,FALSE))","v":""},{"$f":"F586+1","v":9},{"$f":"IF(ISERROR(VLOOKUP(DATE($E$575,$B$574,H586),Holiday,2,FALSE)),\"\",VLOOKUP(DATE($E$575,$B$574,H586),Holiday,2,FALSE))","v":""},{"$f":"H586+1","v":10},{"$f":"IF(ISERROR(VLOOKUP(DATE($E$575,$B$574,J586),Holiday,2,FALSE)),\"\",VLOOKUP(DATE($E$575,$B$574,J586),Holiday,2,FALSE))","v":""},{"$f":"J586+1","v":11},{"$f":"IF(ISERROR(VLOOKUP(DATE($E$575,$B$574,L586),Holiday,2,FALSE)),\"\",VLOOKUP(DATE($E$575,$B$574,L586),Holiday,2,FALSE))","v":""},{"$f":"L586+1","v":12},{"$f":"IF(ISERROR(VLOOKUP(DATE($E$575,$B$574,N586),Holiday,2,FALSE)),\"\",VLOOKUP(DATE($E$575,$B$574,N586),Holiday,2,FALSE))","v":""}]
[]
[null,{"$f":"IF(設定!$C$10=\"\",\"\",設定!$C$10)","v":"パパ"},null,{"$f":"IF(設定!$C$10=\"\",\"\",設定!$C$10)","v":"パパ"},null,{"$f":"IF(設定!$C$10=\"\",\"\",設定!$C$10)","v":"パパ"},null,{"$f":"IF(設定!$C$10=\"\",\"\",設定!$C$10)","v":"パパ"},null,{"$f":"IF(設定!$C$10=\"\",\"\",設定!$C$10)","v":"パパ"},null,{"$f":"IF(設定!$C$10=\"\",\"\",設定!$C$10)","v":"パパ"},null,{"$f":"IF(設定!$C$10=\"\",\"\",設定!$C$10)","v":"パパ"}]
[null,{"$f":"IF(設定!$C$11=\"\",\"\",設定!$C$11)","v":"ママ"},null,{"$f":"IF(設定!$C$11=\"\",\"\",設定!$C$11)","v":"ママ"},null,{"$f":"IF(設定!$C$11=\"\",\"\",設定!$C$11)","v":"ママ"},null,{"$f":"IF(設定!$C$11=\"\",\"\",設定!$C$11)","v":"ママ"},null,{"$f":"IF(設定!$C$11=\"\",\"\",設定!$C$11)","v":"ママ"},null,{"$f":"IF(設定!$C$11=\"\",\"\",設定!$C$11)","v":"ママ"},null,{"$f":"IF(設定!$C$11=\"\",\"\",設定!$C$11)","v":"ママ"}]
[null,{"$f":"IF(設定!$C$12=\"\",\"\",設定!$C$12)","v":"さとる"},null,{"$f":"IF(設定!$C$12=\"\",\"\",設定!$C$12)","v":"さとる"},null,{"$f":"IF(設定!$C$12=\"\",\"\",設定!$C$12)","v":"さとる"},null,{"$f":"IF(設定!$C$12=\"\",\"\",設定!$C$12)","v":"さとる"},null,{"$f":"IF(設定!$C$12=\"\",\"\",設定!$C$12)","v":"さとる"},null,{"$f":"IF(設定!$C$12=\"\",\"\",設定!$C$12)","v":"さとる"},null,{"$f":"IF(設定!$C$12=\"\",\"\",設定!$C$12)","v":"さとる"}]
[null,{"$f":"IF(設定!$C$13=\"\",\"\",設定!$C$13)","v":"くるみ"},null,{"$f":"IF(設定!$C$13=\"\",\"\",設定!$C$13)","v":"くるみ"},null,{"$f":"IF(設定!$C$13=\"\",\"\",設定!$C$13)","v":"くるみ"},null,{"$f":"IF(設定!$C$13=\"\",\"\",設定!$C$13)","v":"くるみ"},null,{"$f":"IF(設定!$C$13=\"\",\"\",設定!$C$13)","v":"くるみ"},null,{"$f":"IF(設定!$C$13=\"\",\"\",設定!$C$13)","v":"くるみ"},null,{"$f":"IF(設定!$C$13=\"\",\"\",設定!$C$13)","v":"くるみ"}]
[null,{"$f":"IF(設定!$C$14=\"\",\"\",設定!$C$14)","v":"ともか"},null,{"$f":"IF(設定!$C$14=\"\",\"\",設定!$C$14)","v":"ともか"},null,{"$f":"IF(設定!$C$14=\"\",\"\",設定!$C$14)","v":"ともか"},null,{"$f":"IF(設定!$C$14=\"\",\"\",設定!$C$14)","v":"ともか"},null,{"$f":"IF(設定!$C$14=\"\",\"\",設定!$C$14)","v":"ともか"},null,{"$f":"IF(設定!$C$14=\"\",\"\",設定!$C$14)","v":"ともか"},null,{"$f":"IF(設定!$C$14=\"\",\"\",設定!$C$14)","v":"ともか"}]
[null,{"$f":"$B$5","v":"月"},null,{"$f":"$D$5","v":"火"},null,{"$f":"$F$5","v":"水"},null,{"$f":"$H$5","v":"木"},null,{"$f":"$J$5","v":"金"},null,{"$f":"$L$5","v":"土"},null,{"$f":"$N$5","v":"日"}]
[null,{"$f":"$N586+1","v":13},{"$f":"IF(ISERROR(VLOOKUP(DATE($E$575,$B$574,B594),Holiday,2,FALSE)),\"\",VLOOKUP(DATE($E$575,$B$574,B594),Holiday,2,FALSE))","v":""},{"$f":"B594+1","v":14},{"$f":"IF(ISERROR(VLOOKUP(DATE($E$575,$B$574,D594),Holiday,2,FALSE)),\"\",VLOOKUP(DATE($E$575,$B$574,D594),Holiday,2,FALSE))","v":""},{"$f":"D594+1","v":15},{"$f":"IF(ISERROR(VLOOKUP(DATE($E$575,$B$574,F594),Holiday,2,FALSE)),\"\",VLOOKUP(DATE($E$575,$B$574,F594),Holiday,2,FALSE))","v":""},{"$f":"F594+1","v":16},{"$f":"IF(ISERROR(VLOOKUP(DATE($E$575,$B$574,H594),Holiday,2,FALSE)),\"\",VLOOKUP(DATE($E$575,$B$574,H594),Holiday,2,FALSE))","v":""},{"$f":"H594+1","v":17},{"$f":"IF(ISERROR(VLOOKUP(DATE($E$575,$B$574,J594),Holiday,2,FALSE)),\"\",VLOOKUP(DATE($E$575,$B$574,J594),Holiday,2,FALSE))","v":""},{"$f":"J594+1","v":18},{"$f":"IF(ISERROR(VLOOKUP(DATE($E$575,$B$574,L594),Holiday,2,FALSE)),\"\",VLOOKUP(DATE($E$575,$B$574,L594),Holiday,2,FALSE))","v":""},{"$f":"L594+1","v":19},{"$f":"IF(ISERROR(VLOOKUP(DATE($E$575,$B$574,N594),Holiday,2,FALSE)),\"\",VLOOKUP(DATE($E$575,$B$574,N594),Holiday,2,FALSE))","v":""}]
[]
[null,{"$f":"IF(設定!$C$10=\"\",\"\",設定!$C$10)","v":"パパ"},null,{"$f":"IF(設定!$C$10=\"\",\"\",設定!$C$10)","v":"パパ"},null,{"$f":"IF(設定!$C$10=\"\",\"\",設定!$C$10)","v":"パパ"},null,{"$f":"IF(設定!$C$10=\"\",\"\",設定!$C$10)","v":"パパ"},null,{"$f":"IF(設定!$C$10=\"\",\"\",設定!$C$10)","v":"パパ"},null,{"$f":"IF(設定!$C$10=\"\",\"\",設定!$C$10)","v":"パパ"},null,{"$f":"IF(設定!$C$10=\"\",\"\",設定!$C$10)","v":"パパ"}]
[null,{"$f":"IF(設定!$C$11=\"\",\"\",設定!$C$11)","v":"ママ"},null,{"$f":"IF(設定!$C$11=\"\",\"\",設定!$C$11)","v":"ママ"},null,{"$f":"IF(設定!$C$11=\"\",\"\",設定!$C$11)","v":"ママ"},null,{"$f":"IF(設定!$C$11=\"\",\"\",設定!$C$11)","v":"ママ"},null,{"$f":"IF(設定!$C$11=\"\",\"\",設定!$C$11)","v":"ママ"},null,{"$f":"IF(設定!$C$11=\"\",\"\",設定!$C$11)","v":"ママ"},null,{"$f":"IF(設定!$C$11=\"\",\"\",設定!$C$11)","v":"ママ"}]
[null,{"$f":"IF(設定!$C$12=\"\",\"\",設定!$C$12)","v":"さとる"},null,{"$f":"IF(設定!$C$12=\"\",\"\",設定!$C$12)","v":"さとる"},null,{"$f":"IF(設定!$C$12=\"\",\"\",設定!$C$12)","v":"さとる"},null,{"$f":"IF(設定!$C$12=\"\",\"\",設定!$C$12)","v":"さとる"},null,{"$f":"IF(設定!$C$12=\"\",\"\",設定!$C$12)","v":"さとる"},null,{"$f":"IF(設定!$C$12=\"\",\"\",設定!$C$12)","v":"さとる"},null,{"$f":"IF(設定!$C$12=\"\",\"\",設定!$C$12)","v":"さとる"}]
[null,{"$f":"IF(設定!$C$13=\"\",\"\",設定!$C$13)","v":"くるみ"},null,{"$f":"IF(設定!$C$13=\"\",\"\",設定!$C$13)","v":"くるみ"},null,{"$f":"IF(設定!$C$13=\"\",\"\",設定!$C$13)","v":"くるみ"},null,{"$f":"IF(設定!$C$13=\"\",\"\",設定!$C$13)","v":"くるみ"},null,{"$f":"IF(設定!$C$13=\"\",\"\",設定!$C$13)","v":"くるみ"},null,{"$f":"IF(設定!$C$13=\"\",\"\",設定!$C$13)","v":"くるみ"},null,{"$f":"IF(設定!$C$13=\"\",\"\",設定!$C$13)","v":"くるみ"}]
[null,{"$f":"IF(設定!$C$14=\"\",\"\",設定!$C$14)","v":"ともか"},null,{"$f":"IF(設定!$C$14=\"\",\"\",設定!$C$14)","v":"ともか"},null,{"$f":"IF(設定!$C$14=\"\",\"\",設定!$C$14)","v":"ともか"},null,{"$f":"IF(設定!$C$14=\"\",\"\",設定!$C$14)","v":"ともか"},null,{"$f":"IF(設定!$C$14=\"\",\"\",設定!$C$14)","v":"ともか"},null,{"$f":"IF(設定!$C$14=\"\",\"\",設定!$C$14)","v":"ともか"},null,{"$f":"IF(設定!$C$14=\"\",\"\",設定!$C$14)","v":"ともか"}]
[null,{"$f":"$B$5","v":"月"},null,{"$f":"$D$5","v":"火"},null,{"$f":"$F$5","v":"水"},null,{"$f":"$H$5","v":"木"},null,{"$f":"$J$5","v":"金"},null,{"$f":"$L$5","v":"土"},null,{"$f":"$N$5","v":"日"}]
[null,{"$f":"$N594+1","v":20},{"$f":"IF(ISERROR(VLOOKUP(DATE($E$575,$B$574,B602),Holiday,2,FALSE)),\"\",VLOOKUP(DATE($E$575,$B$574,B602),Holiday,2,FALSE))","v":""},{"$f":"B602+1","v":21},{"$f":"IF(ISERROR(VLOOKUP(DATE($E$575,$B$574,D602),Holiday,2,FALSE)),\"\",VLOOKUP(DATE($E$575,$B$574,D602),Holiday,2,FALSE))","v":""},{"$f":"D602+1","v":22},{"$f":"IF(ISERROR(VLOOKUP(DATE($E$575,$B$574,F602),Holiday,2,FALSE)),\"\",VLOOKUP(DATE($E$575,$B$574,F602),Holiday,2,FALSE))","v":""},{"$f":"F602+1","v":23},{"$f":"IF(ISERROR(VLOOKUP(DATE($E$575,$B$574,H602),Holiday,2,FALSE)),\"\",VLOOKUP(DATE($E$575,$B$574,H602),Holiday,2,FALSE))","v":"天皇誕生日"},{"$f":"H602+1","v":24},{"$f":"IF(ISERROR(VLOOKUP(DATE($E$575,$B$574,J602),Holiday,2,FALSE)),\"\",VLOOKUP(DATE($E$575,$B$574,J602),Holiday,2,FALSE))","v":""},{"$f":"J602+1","v":25},{"$f":"IF(ISERROR(VLOOKUP(DATE($E$575,$B$574,L602),Holiday,2,FALSE)),\"\",VLOOKUP(DATE($E$575,$B$574,L602),Holiday,2,FALSE))","v":""},{"$f":"L602+1","v":26},{"$f":"IF(ISERROR(VLOOKUP(DATE($E$575,$B$574,N602),Holiday,2,FALSE)),\"\",VLOOKUP(DATE($E$575,$B$574,N602),Holiday,2,FALSE))","v":""}]
[]
[null,{"$f":"IF(設定!$C$10=\"\",\"\",設定!$C$10)","v":"パパ"},null,{"$f":"IF(設定!$C$10=\"\",\"\",設定!$C$10)","v":"パパ"},null,{"$f":"IF(設定!$C$10=\"\",\"\",設定!$C$10)","v":"パパ"},null,{"$f":"IF(設定!$C$10=\"\",\"\",設定!$C$10)","v":"パパ"},null,{"$f":"IF(設定!$C$10=\"\",\"\",設定!$C$10)","v":"パパ"},null,{"$f":"IF(設定!$C$10=\"\",\"\",設定!$C$10)","v":"パパ"},null,{"$f":"IF(設定!$C$10=\"\",\"\",設定!$C$10)","v":"パパ"}]
[null,{"$f":"IF(設定!$C$11=\"\",\"\",設定!$C$11)","v":"ママ"},null,{"$f":"IF(設定!$C$11=\"\",\"\",設定!$C$11)","v":"ママ"},null,{"$f":"IF(設定!$C$11=\"\",\"\",設定!$C$11)","v":"ママ"},null,{"$f":"IF(設定!$C$11=\"\",\"\",設定!$C$11)","v":"ママ"},null,{"$f":"IF(設定!$C$11=\"\",\"\",設定!$C$11)","v":"ママ"},null,{"$f":"IF(設定!$C$11=\"\",\"\",設定!$C$11)","v":"ママ"},null,{"$f":"IF(設定!$C$11=\"\",\"\",設定!$C$11)","v":"ママ"}]
[null,{"$f":"IF(設定!$C$12=\"\",\"\",設定!$C$12)","v":"さとる"},null,{"$f":"IF(設定!$C$12=\"\",\"\",設定!$C$12)","v":"さとる"},null,{"$f":"IF(設定!$C$12=\"\",\"\",設定!$C$12)","v":"さとる"},null,{"$f":"IF(設定!$C$12=\"\",\"\",設定!$C$12)","v":"さとる"},null,{"$f":"IF(設定!$C$12=\"\",\"\",設定!$C$12)","v":"さとる"},null,{"$f":"IF(設定!$C$12=\"\",\"\",設定!$C$12)","v":"さとる"},null,{"$f":"IF(設定!$C$12=\"\",\"\",設定!$C$12)","v":"さとる"}]
[null,{"$f":"IF(設定!$C$13=\"\",\"\",設定!$C$13)","v":"くるみ"},null,{"$f":"IF(設定!$C$13=\"\",\"\",設定!$C$13)","v":"くるみ"},null,{"$f":"IF(設定!$C$13=\"\",\"\",設定!$C$13)","v":"くるみ"},null,{"$f":"IF(設定!$C$13=\"\",\"\",設定!$C$13)","v":"くるみ"},null,{"$f":"IF(設定!$C$13=\"\",\"\",設定!$C$13)","v":"くるみ"},null,{"$f":"IF(設定!$C$13=\"\",\"\",設定!$C$13)","v":"くるみ"},null,{"$f":"IF(設定!$C$13=\"\",\"\",設定!$C$13)","v":"くるみ"}]
[null,{"$f":"IF(設定!$C$14=\"\",\"\",設定!$C$14)","v":"ともか"},null,{"$f":"IF(設定!$C$14=\"\",\"\",設定!$C$14)","v":"ともか"},null,{"$f":"IF(設定!$C$14=\"\",\"\",設定!$C$14)","v":"ともか"},null,{"$f":"IF(設定!$C$14=\"\",\"\",設定!$C$14)","v":"ともか"},null,{"$f":"IF(設定!$C$14=\"\",\"\",設定!$C$14)","v":"ともか"},null,{"$f":"IF(設定!$C$14=\"\",\"\",設定!$C$14)","v":"ともか"},null,{"$f":"IF(設定!$C$14=\"\",\"\",設定!$C$14)","v":"ともか"}]
[null,{"$f":"$B$5","v":"月"},null,{"$f":"$D$5","v":"火"},null,{"$f":"$F$5","v":"水"},null,{"$f":"$H$5","v":"木"},null,{"$f":"$J$5","v":"金"},null,{"$f":"$L$5","v":"土"},null,{"$f":"$N$5","v":"日"}]
[null,{"$f":"$N602+1","v":27},{"$f":"IF(ISERROR(VLOOKUP(DATE($E$575,$B$574,B610),Holiday,2,FALSE)),\"\",VLOOKUP(DATE($E$575,$B$574,B610),Holiday,2,FALSE))","v":""},{"$f":"B610+1","v":28},{"$f":"IF(ISERROR(VLOOKUP(DATE($E$575,$B$574,D610),Holiday,2,FALSE)),\"\",VLOOKUP(DATE($E$575,$B$574,D610),Holiday,2,FALSE))","v":""},{"$f":"D610+1","v":29},{"$f":"IF(ISERROR(VLOOKUP(DATE($E$575,$B$574,F610),Holiday,2,FALSE)),\"\",VLOOKUP(DATE($E$575,$B$574,F610),Holiday,2,FALSE))","v":""},{"$f":"F610+1","v":30},{"$f":"IF(ISERROR(VLOOKUP(DATE($E$575,$B$574,H610),Holiday,2,FALSE)),\"\",VLOOKUP(DATE($E$575,$B$574,H610),Holiday,2,FALSE))","v":""},{"$f":"H610+1","v":31},{"$f":"IF(ISERROR(VLOOKUP(DATE($E$575,$B$574,J610),Holiday,2,FALSE)),\"\",VLOOKUP(DATE($E$575,$B$574,J610),Holiday,2,FALSE))","v":""},{"$f":"J610+1","v":32},{"$f":"IF(ISERROR(VLOOKUP(DATE($E$575,$B$574,L610),Holiday,2,FALSE)),\"\",VLOOKUP(DATE($E$575,$B$574,L610),Holiday,2,FALSE))","v":"元日"},{"$f":"L610+1","v":33},{"$f":"IF(ISERROR(VLOOKUP(DATE($E$575,$B$574,N610),Holiday,2,FALSE)),\"\",VLOOKUP(DATE($E$575,$B$574,N610),Holiday,2,FALSE))","v":""}]
[]
[null,{"$f":"IF(設定!$C$10=\"\",\"\",設定!$C$10)","v":"パパ"},null,{"$f":"IF(設定!$C$10=\"\",\"\",設定!$C$10)","v":"パパ"},null,{"$f":"IF(設定!$C$10=\"\",\"\",設定!$C$10)","v":"パパ"},null,{"$f":"IF(設定!$C$10=\"\",\"\",設定!$C$10)","v":"パパ"},null,{"$f":"IF(設定!$C$10=\"\",\"\",設定!$C$10)","v":"パパ"},null,{"$f":"IF(設定!$C$10=\"\",\"\",設定!$C$10)","v":"パパ"},null,{"$f":"IF(設定!$C$10=\"\",\"\",設定!$C$10)","v":"パパ"}]
[null,{"$f":"IF(設定!$C$11=\"\",\"\",設定!$C$11)","v":"ママ"},null,{"$f":"IF(設定!$C$11=\"\",\"\",設定!$C$11)","v":"ママ"},null,{"$f":"IF(設定!$C$11=\"\",\"\",設定!$C$11)","v":"ママ"},null,{"$f":"IF(設定!$C$11=\"\",\"\",設定!$C$11)","v":"ママ"},null,{"$f":"IF(設定!$C$11=\"\",\"\",設定!$C$11)","v":"ママ"},null,{"$f":"IF(設定!$C$11=\"\",\"\",設定!$C$11)","v":"ママ"},null,{"$f":"IF(設定!$C$11=\"\",\"\",設定!$C$11)","v":"ママ"}]
[null,{"$f":"IF(設定!$C$12=\"\",\"\",設定!$C$12)","v":"さとる"},null,{"$f":"IF(設定!$C$12=\"\",\"\",設定!$C$12)","v":"さとる"},null,{"$f":"IF(設定!$C$12=\"\",\"\",設定!$C$12)","v":"さとる"},null,{"$f":"IF(設定!$C$12=\"\",\"\",設定!$C$12)","v":"さとる"},null,{"$f":"IF(設定!$C$12=\"\",\"\",設定!$C$12)","v":"さとる"},null,{"$f":"IF(設定!$C$12=\"\",\"\",設定!$C$12)","v":"さとる"},null,{"$f":"IF(設定!$C$12=\"\",\"\",設定!$C$12)","v":"さとる"}]
[null,{"$f":"IF(設定!$C$13=\"\",\"\",設定!$C$13)","v":"くるみ"},null,{"$f":"IF(設定!$C$13=\"\",\"\",設定!$C$13)","v":"くるみ"},null,{"$f":"IF(設定!$C$13=\"\",\"\",設定!$C$13)","v":"くるみ"},null,{"$f":"IF(設定!$C$13=\"\",\"\",設定!$C$13)","v":"くるみ"},null,{"$f":"IF(設定!$C$13=\"\",\"\",設定!$C$13)","v":"くるみ"},null,{"$f":"IF(設定!$C$13=\"\",\"\",設定!$C$13)","v":"くるみ"},null,{"$f":"IF(設定!$C$13=\"\",\"\",設定!$C$13)","v":"くるみ"}]
[null,{"$f":"IF(設定!$C$14=\"\",\"\",設定!$C$14)","v":"ともか"},null,{"$f":"IF(設定!$C$14=\"\",\"\",設定!$C$14)","v":"ともか"},null,{"$f":"IF(設定!$C$14=\"\",\"\",設定!$C$14)","v":"ともか"},null,{"$f":"IF(設定!$C$14=\"\",\"\",設定!$C$14)","v":"ともか"},null,{"$f":"IF(設定!$C$14=\"\",\"\",設定!$C$14)","v":"ともか"},null,{"$f":"IF(設定!$C$14=\"\",\"\",設定!$C$14)","v":"ともか"},null,{"$f":"IF(設定!$C$14=\"\",\"\",設定!$C$14)","v":"ともか"}]
[null,{"$f":"$B$5","v":"月"},null,{"$f":"$D$5","v":"火"},null,{"$f":"$F$5","v":"水"},null,{"$f":"$H$5","v":"木"},null,{"$f":"$J$5","v":"金"},null,{"$f":"$L$5","v":"土"},null,{"$f":"$N$5","v":"日"}]
[null,{"$f":"$N610+1","v":34},{"$f":"IF(ISERROR(VLOOKUP(DATE($E$575,$B$574,B618),Holiday,2,FALSE)),\"\",VLOOKUP(DATE($E$575,$B$574,B618),Holiday,2,FALSE))","v":""},{"$f":"B618+1","v":35},{"$f":"IF(ISERROR(VLOOKUP(DATE($E$575,$B$574,D618),Holiday,2,FALSE)),\"\",VLOOKUP(DATE($E$575,$B$574,D618),Holiday,2,FALSE))","v":""},{"$f":"D618+1","v":36},{"$f":"IF(ISERROR(VLOOKUP(DATE($E$575,$B$574,F618),Holiday,2,FALSE)),\"\",VLOOKUP(DATE($E$575,$B$574,F618),Holiday,2,FALSE))","v":""},{"$f":"F618+1","v":37},{"$f":"IF(ISERROR(VLOOKUP(DATE($E$575,$B$574,H618),Holiday,2,FALSE)),\"\",VLOOKUP(DATE($E$575,$B$574,H618),Holiday,2,FALSE))","v":""},{"$f":"H618+1","v":38},{"$f":"IF(ISERROR(VLOOKUP(DATE($E$575,$B$574,J618),Holiday,2,FALSE)),\"\",VLOOKUP(DATE($E$575,$B$574,J618),Holiday,2,FALSE))","v":""},{"$f":"J618+1","v":39},{"$f":"IF(ISERROR(VLOOKUP(DATE($E$575,$B$574,L618),Holiday,2,FALSE)),\"\",VLOOKUP(DATE($E$575,$B$574,L618),Holiday,2,FALSE))","v":""},{"$f":"L618+1","v":40},{"$f":"IF(ISERROR(VLOOKUP(DATE($E$575,$B$574,N618),Holiday,2,FALSE)),\"\",VLOOKUP(DATE($E$575,$B$574,N618),Holiday,2,FALSE))","v":""}]
[]
[null,{"$f":"IF(設定!$C$10=\"\",\"\",設定!$C$10)","v":"パパ"},null,{"$f":"IF(設定!$C$10=\"\",\"\",設定!$C$10)","v":"パパ"},null,{"$f":"IF(設定!$C$10=\"\",\"\",設定!$C$10)","v":"パパ"},null,{"$f":"IF(設定!$C$10=\"\",\"\",設定!$C$10)","v":"パパ"},null,{"$f":"IF(設定!$C$10=\"\",\"\",設定!$C$10)","v":"パパ"},null,{"$f":"IF(設定!$C$10=\"\",\"\",設定!$C$10)","v":"パパ"},null,{"$f":"IF(設定!$C$10=\"\",\"\",設定!$C$10)","v":"パパ"}]
[null,{"$f":"IF(設定!$C$11=\"\",\"\",設定!$C$11)","v":"ママ"},null,{"$f":"IF(設定!$C$11=\"\",\"\",設定!$C$11)","v":"ママ"},null,{"$f":"IF(設定!$C$11=\"\",\"\",設定!$C$11)","v":"ママ"},null,{"$f":"IF(設定!$C$11=\"\",\"\",設定!$C$11)","v":"ママ"},null,{"$f":"IF(設定!$C$11=\"\",\"\",設定!$C$11)","v":"ママ"},null,{"$f":"IF(設定!$C$11=\"\",\"\",設定!$C$11)","v":"ママ"},null,{"$f":"IF(設定!$C$11=\"\",\"\",設定!$C$11)","v":"ママ"}]
[null,{"$f":"IF(設定!$C$12=\"\",\"\",設定!$C$12)","v":"さとる"},null,{"$f":"IF(設定!$C$12=\"\",\"\",設定!$C$12)","v":"さとる"},null,{"$f":"IF(設定!$C$12=\"\",\"\",設定!$C$12)","v":"さとる"},null,{"$f":"IF(設定!$C$12=\"\",\"\",設定!$C$12)","v":"さとる"},null,{"$f":"IF(設定!$C$12=\"\",\"\",設定!$C$12)","v":"さとる"},null,{"$f":"IF(設定!$C$12=\"\",\"\",設定!$C$12)","v":"さとる"},null,{"$f":"IF(設定!$C$12=\"\",\"\",設定!$C$12)","v":"さとる"}]
[null,{"$f":"IF(設定!$C$13=\"\",\"\",設定!$C$13)","v":"くるみ"},null,{"$f":"IF(設定!$C$13=\"\",\"\",設定!$C$13)","v":"くるみ"},null,{"$f":"IF(設定!$C$13=\"\",\"\",設定!$C$13)","v":"くるみ"},null,{"$f":"IF(設定!$C$13=\"\",\"\",設定!$C$13)","v":"くるみ"},null,{"$f":"IF(設定!$C$13=\"\",\"\",設定!$C$13)","v":"くるみ"},null,{"$f":"IF(設定!$C$13=\"\",\"\",設定!$C$13)","v":"くるみ"},null,{"$f":"IF(設定!$C$13=\"\",\"\",設定!$C$13)","v":"くるみ"}]
[null,{"$f":"IF(設定!$C$14=\"\",\"\",設定!$C$14)","v":"ともか"},null,{"$f":"IF(設定!$C$14=\"\",\"\",設定!$C$14)","v":"ともか"},null,{"$f":"IF(設定!$C$14=\"\",\"\",設定!$C$14)","v":"ともか"},null,{"$f":"IF(設定!$C$14=\"\",\"\",設定!$C$14)","v":"ともか"},null,{"$f":"IF(設定!$C$14=\"\",\"\",設定!$C$14)","v":"ともか"},null,{"$f":"IF(設定!$C$14=\"\",\"\",設定!$C$14)","v":"ともか"},null,{"$f":"IF(設定!$C$14=\"\",\"\",設定!$C$14)","v":"ともか"}]

{"sheet":"祝日","index":2,"n_rows":335,"n_cols":2,"rows_kept":335,"cut":false,"hidden":true,"merged":[]}
["日付","祝日名"]
["2013-01-01","元日"]
["2013-01-14","成人の日"]
["2013-02-11","建国記念の日"]
["2013-03-20","春分の日"]
["2013-04-29","昭和の日"]
["2013-05-03","憲法記念日"]
["2013-05-04","みどりの日"]
["2013-05-05","こどもの日"]
["2013-05-06","振替休日"]
["2013-07-15","海の日"]
["2013-09-16","敬老の日"]
["2013-09-23","秋分の日"]
["2013-10-14","体育の日"]
["2013-11-03","文化の日"]
["2013-11-04","振替休日"]
["2013-11-23","勤労感謝の日"]
["2013-12-23","天皇誕生日"]
["2014-01-01","元日"]
["2014-01-13","成人の日"]
["2014-02-11","建国記念の日"]
["2014-03-21","春分の日"]
["2014-04-29","昭和の日"]
["2014-05-03","憲法記念日"]
["2014-05-04","みどりの日"]
["2014-05-05","こどもの日"]
["2014-05-06","振替休日"]
["2014-07-21","海の日"]
["2014-09-15","敬老の日"]
["2014-09-23","秋分の日"]
["2014-10-13","体育の日"]
["2014-11-03","文化の日"]
["2014-11-23","勤労感謝の日"]
["2014-11-24","振替休日"]
["2014-12-23","天皇誕生日"]
["2015-01-01","元日"]
["2015-01-12","成人の日"]
["2015-02-11","建国記念の日"]
["2015-03-21","春分の日"]
["2015-04-29","昭和の日"]
["2015-05-03","憲法記念日"]
["2015-05-04","みどりの日"]
["2015-05-05","こどもの日"]
["2015-05-06","振替休日"]
["2015-07-20","海の日"]
["2015-09-21","敬老の日"]
["2015-09-22","国民の休日"]
["2015-09-23","秋分の日"]
["2015-10-12","体育の日"]
["2015-11-03","文化の日"]
["2015-11-23","勤労感謝の日"]
["2015-12-23","天皇誕生日"]
["2016-01-01","元日"]
["2016-01-11","成人の日"]
["2016-02-11","建国記念の日"]
["2016-03-20","春分の日"]
["2016-03-21","振替休日"]
["2016-04-29","昭和の日"]
["2016-05-03","憲法記念日"]
["2016-05-04","みどりの日"]
["2016-05-05","こどもの日"]
["2016-07-18","海の日"]
["2016-09-19","敬老の日"]
["2016-09-22","秋分の日"]
["2016-10-10","体育の日"]
["2016-11-03","文化の日"]
["2016-11-23","勤労感謝の日"]
["2016-12-23","天皇誕生日"]
["2017-01-01","元日"]
["2017-01-02","振替休日"]
["2017-01-09","成人の日"]
["2017-02-11","建国記念の日"]
["2017-03-20","春分の日"]
["2017-04-29","昭和の日"]
["2017-05-03","憲法記念日"]
["2017-05-04","みどりの日"]
["2017-05-05","こどもの日"]
["2017-07-17","海の日"]
["2017-09-18","敬老の日"]
["2017-09-23","秋分の日"]
["2017-10-09","体育の日"]
["2017-11-03","文化の日"]
["2017-11-23","勤労感謝の日"]
["2017-12-23","天皇誕生日"]
["2018-01-01","元日"]
["2018-01-08","成人の日"]
["2018-02-11","建国記念の日"]
["2018-02-12","振替休日"]
["2018-03-21","春分の日"]
["2018-04-29","昭和の日"]
["2018-04-30","振替休日"]
["2018-05-03","憲法記念日"]
["2018-05-04","みどりの日"]
["2018-05-05","こどもの日"]
["2018-07-16","海の日"]
["2018-09-17","敬老の日"]
["2018-09-23","秋分の日"]
["2018-09-24","振替休日"]
["2018-10-08","体育の日"]
["2018-11-03","文化の日"]
["2018-11-23","勤労感謝の日"]
["2018-12-23","天皇誕生日"]
["2018-12-24","振替休日"]
["2019-01-01","元日"]
["2019-01-14","成人の日"]
["2019-02-11","建国記念の日"]
["2019-03-21","春分の日"]
["2019-04-29","昭和の日"]
["2019-05-03","憲法記念日"]
["2019-05-04","みどりの日"]
["2019-05-05","こどもの日"]
["2019-05-06","振替休日"]
["2019-07-15","海の日"]
["2019-09-16","敬老の日"]
["2019-09-23","秋分の日"]
["2019-10-14","体育の日"]
["2019-11-03","文化の日"]
["2019-11-04","振替休日"]
["2019-11-23","勤労感謝の日"]
["2019-12-23","天皇誕生日"]
["2020-01-01","元日"]
["2020-01-13","成人の日"]
["2020-02-11","建国記念の日"]
["2020-03-20","春分の日"]
["2020-04-29","昭和の日"]
["2020-05-03","憲法記念日"]
["2020-05-04","みどりの日"]
["2020-05-05","こどもの日"]
["2020-05-06","振替休日"]
["2020-07-20","海の日"]
["2020-09-21","敬老の日"]
["2020-09-22","秋分の日"]
["2020-10-12","体育の日"]
["2020-11-03","文化の日"]
["2020-11-23","勤労感謝の日"]
["2020-12-23","天皇誕生日"]
["2021-01-01","元日"]
["2021-01-11","成人の日"]
["2021-02-11","建国記念の日"]
["2021-03-20","春分の日"]
["2021-04-29","昭和の日"]
["2021-05-03","憲法記念日"]
["2021-05-04","みどりの日"]
["2021-05-05","こどもの日"]
["2021-07-19","海の日"]
["2021-09-20","敬老の日"]
["2021-09-23","秋分の日"]
["2021-10-11","体育の日"]
["2021-11-03","文化の日"]
["2021-11-23","勤労感謝の日"]
["2021-12-23","天皇誕生日"]
["2022-01-01","元日"]
["2022-01-10","成人の日"]
["2022-02-11","建国記念の日"]
["2022-03-21","春分の日"]
["2022-04-29","昭和の日"]
["2022-05-03","憲法記念日"]
["2022-05-04","みどりの日"]
["2022-05-05","こどもの日"]
["2022-07-18","海の日"]
["2022-09-19","敬老の日"]
["2022-09-23","秋分の日"]
["2022-10-10","体育の日"]
["2022-11-03","文化の日"]
["2022-11-23","勤労感謝の日"]
["2022-12-23","天皇誕生日"]
["2023-01-01","元日"]
["2023-01-02","振替休日"]
["2023-01-09","成人の日"]
["2023-02-11","建国記念の日"]
["2023-03-21","春分の日"]
["2023-04-29","昭和の日"]
["2023-05-03","憲法記念日"]
["2023-05-04","みどりの日"]
["2023-05-05","こどもの日"]
["2023-07-17","海の日"]
["2023-09-18","敬老の日"]
["2023-09-23","秋分の日"]
["2023-10-09","体育の日"]
["2023-11-03","文化の日"]
["2023-11-23","勤労感謝の日"]
["2023-12-23","天皇誕生日"]
["2024-01-01","元日"]
["2024-01-08","成人の日"]
["2024-02-11","建国記念の日"]
["2024-02-12","振替休日"]
["2024-03-20","春分の日"]
["2024-04-29","昭和の日"]
["2024-05-03","憲法記念日"]
["2024-05-04","みどりの日"]
["2024-05-05","こどもの日"]
["2024-05-06","振替休日"]
["2024-07-15","海の日"]
["2024-09-16","敬老の日"]
["2024-09-22","秋分の日"]
["2024-09-23","振替休日"]
["2024-10-14","体育の日"]
["2024-11-03","文化の日"]
["2024-11-04","振替休日"]
["2024-11-23","勤労感謝の日"]
["2024-12-23","天皇誕生日"]
["2025-01-01","元日"]
["2025-01-13","成人の日"]
["2025-02-11","建国記念の日"]
["2025-03-20","春分の日"]
["2025-04-29","昭和の日"]
["2025-05-03","憲法記念日"]
["2025-05-04","みどりの日"]
["2025-05-05","こどもの日"]
["2025-05-06","振替休日"]
["2025-07-21","海の日"]
["2025-09-15","敬老の日"]
["2025-09-23","秋分の日"]
["2025-10-13","体育の日"]
["2025-11-03","文化の日"]
["2025-11-23","勤労感謝の日"]
["2025-11-24","振替休日"]
["2025-12-23","天皇誕生日"]
["2026-01-01","元日"]
["2026-01-12","成人の日"]
["2026-02-11","建国記念の日"]
["2026-03-20","春分の日"]
["2026-04-29","昭和の日"]
["2026-05-03","憲法記念日"]
["2026-05-04","みどりの日"]
["2026-05-05","こどもの日"]
["2026-05-06","振替休日"]
["2026-07-20","海の日"]
["2026-09-21","敬老の日"]
["2026-09-22","国民の休日"]
["2026-09-23","秋分の日"]
["2026-10-12","体育の日"]
["2026-11-03","文化の日"]
["2026-11-23","勤労感謝の日"]
["2026-12-23","天皇誕生日"]
["2027-01-01","元日"]
["2027-01-11","成人の日"]
["2027-02-11","建国記念の日"]
["2027-03-21","春分の日"]
["2027-03-22","振替休日"]
["2027-04-29","昭和の日"]
["2027-05-03","憲法記念日"]
["2027-05-04","みどりの日"]
["2027-05-05","こどもの日"]
["2027-07-19","海の日"]
["2027-09-20","敬老の日"]
["2027-09-23","秋分の日"]
["2027-10-11","体育の日"]
["2027-11-03","文化の日"]
["2027-11-23","勤労感謝の日"]
["2027-12-23","天皇誕生日"]
["2028-01-01","元日"]
["2028-01-10","成人の日"]
["2028-02-11","建国記念の日"]
["2028-03-20","春分の日"]
["2028-04-29","昭和の日"]
["2028-05-03","憲法記念日"]
["2028-05-04","みどりの日"]
["2028-05-05","こどもの日"]
["2028-07-17","海の日"]
["2028-09-18","敬老の日"]
["2028-09-22","秋分の日"]
["2028-10-09","体育の日"]
["2028-11-03","文化の日"]
["2028-11-23","勤労感謝の日"]
["2028-12-23","天皇誕生日"]
["2029-01-01","元日"]
["2029-01-08","成人の日"]
["2029-02-11","建国記念の日"]
["2029-02-12","振替休日"]
["2029-03-20","春分の日"]
["2029-04-29","昭和の日"]
["2029-04-30","振替休日"]
["2029-05-03","憲法記念日"]
["2029-05-04","みどりの日"]
["2029-05-05","こどもの日"]
["2029-07-16","海の日"]
["2029-09-17","敬老の日"]
["2029-09-23","秋分の日"]
["2029-09-24","振替休日"]
["2029-10-08","体育の日"]
["2029-11-03","文化の日"]
["2029-11-23","勤労感謝の日"]
["2029-12-23","天皇誕生日"]
["2029-12-24","振替休日"]
["2030-01-01","元日"]
["2030-01-14","成人の日"]
["2030-02-11","建国記念の日"]
["2030-03-20","春分の日"]
["2030-04-29","昭和の日"]
["2030-05-03","憲法記念日"]
["2030-05-04","みどりの日"]
["2030-05-05","こどもの日"]
["2030-05-06","振替休日"]
["2030-07-15","海の日"]
["2030-09-16","敬老の日"]
["2030-09-23","秋分の日"]
["2030-10-14","体育の日"]
["2030-11-03","文化の日"]
["2030-11-04","振替休日"]
["2030-11-23","勤労感謝の日"]
["2030-12-23","天皇誕生日"]
["2031-01-01","元日"]
["2031-01-13","成人の日"]
["2031-02-11","建国記念の日"]
["2031-03-21","春分の日"]
["2031-04-29","昭和の日"]
["2031-05-03","憲法記念日"]
["2031-05-04","みどりの日"]
["2031-05-05","こどもの日"]
["2031-05-06","振替休日"]
["2031-07-21","海の日"]
["2031-09-15","敬老の日"]
["2031-09-23","秋分の日"]
["2031-10-13","体育の日"]
["2031-11-03","文化の日"]
["2031-11-23","勤労感謝の日"]
["2031-11-24","振替休日"]
["2031-12-23","天皇誕生日"]
["2032-01-01","元日"]
["2032-01-12","成人の日"]
["2032-02-11","建国記念の日"]
["2032-03-20","春分の日"]
["2032-04-29","昭和の日"]
["2032-05-03","憲法記念日"]
["2032-05-04","みどりの日"]
["2032-05-05","こどもの日"]
["2032-07-19","海の日"]
["2032-09-20","敬老の日"]
["2032-09-21","国民の休日"]
["2032-09-22","秋分の日"]
["2032-10-11","体育の日"]
["2032-11-03","文化の日"]
["2032-11-23","勤労感謝の日"]
["2032-12-23","天皇誕生日"]