{"text_format":"1","workbook":"xlsx","n_sheets":5,"sheets":["使い方","入力シート（サンプル）","入力シート","祝日設定","image"],"not_rendered":{"charts":0,"images":25,"macros":1,"external_links":0,"defined_names":0,"comments":0,"pivot_tables":0},"unopened":[],"bounds":{"document_bytes":16777216,"sheet_cells":100000,"rows_first":2000,"rows_last":500,"rows_between":2000,"halvings":0,"cell_chars":16384,"cell_head_chars":4096},"cells_cut":0,"cells_raw":0,"read":"whole","date_system":"1900"}

{"sheet":"使い方","index":0,"n_rows":0,"n_cols":0,"rows_kept":0,"cut":false,"hidden":false,"merged":[]}

{"sheet":"入力シート（サンプル）","index":1,"n_rows":48,"n_cols":63,"rows_kept":48,"cut":false,"hidden":false,"merged":[[2,52,2,54],[2,59,2,61],[3,10,3,12],[3,17,3,19],[3,24,3,26],[3,31,3,33],[3,38,3,40],[3,45,3,47],[3,52,3,54],[3,57,5,61],[2,10,2,12],[2,17,2,19],[2,24,2,26],[2,31,2,33],[2,38,2,40],[2,45,2,47],[4,52,4,54],[5,10,5,12],[5,17,5,19],[5,24,5,26],[5,31,5,33],[5,38,5,40],[5,45,5,47],[5,52,5,54],[4,10,4,12],[4,17,4,19],[4,24,4,26],[4,31,4,33],[4,38,4,40],[4,45,4,47],[6,52,6,54],[6,59,6,61],[7,2,9,2],[7,6,8,6],[7,10,7,12],[7,17,7,19],[7,24,7,26],[7,31,7,33],[7,38,7,40],[7,45,7,47],[6,10,6,12],[6,17,6,19],[6,24,6,26],[6,31,6,33],[6,38,6,40],[6,45,6,47],[7,52,7,54],[7,57,7,59],[8,10,8,12],[8,17,8,19],[8,24,8,26],[8,31,8,33],[8,38,8,40],[8,45,8,47],[8,52,8,54],[8,57,8,59],[9,45,9,47],[9,52,9,54],[9,57,9,59],[10,10,10,12],[10,17,10,19],[10,24,10,26],[10,31,10,33],[10,38,10,40],[10,45,10,47],[10,52,10,54],[9,10,9,12],[9,17,9,19],[9,24,9,26],[9,31,9,33],[9,38,9,40],[12,2,13,2],[12,10,12,12],[12,17,12,19],[12,24,12,26],[12,31,12,33],[12,38,12,40],[10,57,10,59],[11,6,12,6],[11,10,11,12],[11,17,11,19],[11,24,11,26],[11,31,11,33],[11,38,11,40],[11,45,11,47],[11,52,11,54],[11,57,11,59],[9,6,10,6],[12,45,12,47],[12,52,12,54],[12,57,12,59],[13,6,14,6],[13,10,13,12],[13,17,13,19],[13,24,13,26],[13,31,13,33],[13,38,13,40],[13,45,13,47],[13,52,13,54],[13,57,13,59],[14,10,14,12],[14,17,14,19],[14,24,14,26],[14,31,14,33],[14,38,14,40],[14,45,14,47],[14,52,14,54],[14,57,14,59],[15,45,15,47],[15,52,15,54],[15,57,15,59],[16,10,16,12],[16,17,16,19],[16,24,16,26],[16,31,16,33],[16,38,16,40],[16,45,16,47],[16,52,16,54],[15,10,15,12],[15,17,15,19],[15,24,15,26],[15,31,15,33],[15,38,15,40],[16,57,16,59],[17,6,18,6],[17,10,17,12],[17,17,17,19],[17,24,17,26],[17,31,17,33],[17,38,17,40],[17,45,17,47],[17,52,17,54],[17,57,17,59],[15,6,16,6],[18,52,18,54],[18,57,18,59],[19,6,20,6],[19,10,19,12],[19,17,19,19],[19,24,19,26],[19,31,19,33],[19,38,19,40],[19,45,19,47],[19,52,19,54],[18,10,18,12],[18,17,18,19],[18,24,18,26],[18,31,18,33],[18,38,18,40],[18,45,18,47],[19,57,19,59],[20,10,20,12],[20,17,20,19],[20,24,20,26],[20,31,20,33],[20,38,20,40],[20,45,20,47],[20,52,20,54],[20,57,20,59],[21,45,21,47],[21,52,21,54],[21,57,21,59],[22,10,22,12],[22,17,22,19],[22,24,22,26],[22,31,22,33],[22,38,22,40],[22,45,22,47],[22,52,22,54],[21,10,21,12],[21,17,21,19],[21,24,21,26],[21,31,21,33],[21,38,21,40],[22,57,22,59],[23,6,24,6],[23,10,23,12],[23,17,23,19],[23,24,23,26],[23,31,23,33],[23,38,23,40],[23,45,23,47],[23,52,23,54],[23,57,23,59],[21,6,22,6],[24,52,24,54],[24,57,24,59],[25,6,26,6],[25,10,25,12],[25,17,25,19],[25,24,25,26],[25,31,25,33],[25,38,25,40],[25,45,25,47],[25,52,25,54],[24,10,24,12],[24,17,24,19],[24,24,24,26],[24,31,24,33],[24,38,24,40],[24,45,24,47],[25,57,25,59],[26,10,26,12],[26,17,26,19],[26,24,26,26],[26,31,26,33],[26,38,26,40],[26,45,26,47],[26,52,26,54],[26,57,26,59],[27,52,27,54],[27,57,27,59],[30,2,32,2],[30,8,30,10],[30,15,30,17],[30,22,30,24],[30,29,30,31],[30,36,30,38],[30,43,30,45],[30,50,30,52],[27,10,27,12],[27,17,27,19],[27,24,27,26],[27,31,27,33],[27,38,27,40],[27,45,27,47],[30,57,30,59],[32,8,32,10],[32,15,32,17],[32,22,32,24],[32,29,32,31],[32,36,32,38],[32,43,32,45],[32,50,32,52],[32,57,32,59],[33,50,33,52],[33,57,33,59],[34,8,34,10],[34,15,34,17],[34,22,34,24],[34,29,34,31],[34,36,34,38],[34,43,34,45],[34,50,34,52],[34,57,34,59],[33,8,33,10],[33,15,33,17],[33,22,33,24],[33,29,33,31],[33,36,33,38],[33,43,33,45],[35,50,35,52],[35,57,35,59],[36,8,36,10],[36,15,36,17],[36,22,36,24],[36,29,36,31],[36,36,36,38],[36,43,36,45],[36,50,36,52],[36,57,36,59],[35,8,35,10],[35,15,35,17],[35,22,35,24],[35,29,35,31],[35,36,35,38],[35,43,35,45],[37,50,37,52],[37,57,37,59],[38,8,38,10],[38,15,38,17],[38,22,38,24],[38,29,38,31],[38,36,38,38],[38,43,38,45],[38,50,38,52],[38,57,38,59],[37,8,37,10],[37,15,37,17],[37,22,37,24],[37,29,37,31],[37,36,37,38],[37,43,37,45],[39,50,39,52],[39,57,39,59],[40,8,40,10],[40,15,40,17],[40,22,40,24],[40,29,40,31],[40,36,40,38],[40,43,40,45],[40,50,40,52],[40,57,40,59],[39,8,39,10],[39,15,39,17],[39,22,39,24],[39,29,39,31],[39,36,39,38],[39,43,39,45],[41,50,41,52],[41,57,41,59],[42,8,42,10],[42,15,42,17],[42,22,42,24],[42,29,42,31],[42,36,42,38],[42,43,42,45],[42,50,42,52],[42,57,42,59],[41,8,41,10],[41,15,41,17],[41,22,41,24],[41,29,41,31],[41,36,41,38],[41,43,41,45],[45,50,45,52],[45,57,45,59],[47,8,47,10],[47,15,47,17],[47,22,47,24],[47,29,47,31],[47,36,47,38],[47,43,47,45],[47,50,47,52],[47,57,47,59],[45,8,45,10],[45,15,45,17],[45,22,45,24],[45,29,45,31],[45,36,45,38],[45,43,45,45]]}
[]
[]
[]
[null,null,null,null,null,null,null,null,{"$f":"C13","v":"2014-05-12"},null,null,null,null,null,null,{"$f":"I4+1","v":"2014-05-13"},null,null,null,null,null,null,{"$f":"P4+1","v":"2014-05-14"},null,null,null,null,null,null,{"$f":"W4+1","v":"2014-05-15"},null,null,null,null,null,null,{"$f":"AD4+1","v":"2014-05-16"},null,null,null,null,null,null,{"$f":"AK4+1","v":"2014-05-17"},null,null,null,null,null,null,{"$f":"AR4+1","v":"2014-05-18"},null,null,null,null,null,null,"Weekly\nTO DO"]
[null,null,null,null,null,null,null,null,{"$f":"IF(I4=\"\",\"\",I4)","v":"2014-05-12"},null,null,null,null,null,null,{"$f":"IF(P4=\"\",\"\",P4)","v":"2014-05-13"},null,null,null,null,null,null,{"$f":"IF(W4=\"\",\"\",W4)","v":"2014-05-14"},null,null,null,null,null,null,{"$f":"IF(AD4=\"\",\"\",AD4)","v":"2014-05-15"},null,null,null,null,null,null,{"$f":"IF(AK4=\"\",\"\",AK4)","v":"2014-05-16"},null,null,null,null,null,null,{"$f":"IF(AR4=\"\",\"\",AR4)","v":"2014-05-17"},null,null,null,null,null,null,{"$f":"IF(AY4=\"\",\"\",AY4)","v":"2014-05-18"}]
[null,null,null,null,null,null,null,null,{"$f":"IF(I4=\"\",\"\",UPPER(TEXT(DATE(YEAR(I4),MONTH(I4),DAY(I4)),\"ddd\")))","v":"MON"},null,null,null,null,null,null,{"$f":"IF(P4=\"\",\"\",UPPER(TEXT(DATE(YEAR(P4),MONTH(P4),DAY(P4)),\"ddd\")))","v":"TUE"},null,null,null,null,null,null,{"$f":"IF(W4=\"\",\"\",UPPER(TEXT(DATE(YEAR(W4),MONTH(W4),DAY(W4)),\"ddd\")))","v":"WED"},null,null,null,null,null,null,{"$f":"IF(AD4=\"\",\"\",UPPER(TEXT(DATE(YEAR(AD4),MONTH(AD4),DAY(AD4)),\"ddd\")))","v":"THU"},null,null,null,null,null,null,{"$f":"IF(AK4=\"\",\"\",UPPER(TEXT(DATE(YEAR(AK4),MONTH(AK4),DAY(AK4)),\"ddd\")))","v":"FRI"},null,null,null,null,null,null,{"$f":"IF(AR4=\"\",\"\",UPPER(TEXT(DATE(YEAR(AR4),MONTH(AR4),DAY(AR4)),\"ddd\")))","v":"SAT"},null,null,null,null,null,null,{"$f":"IF(AY4=\"\",\"\",UPPER(TEXT(DATE(YEAR(AY4),MONTH(AY4),DAY(AY4)),\"ddd\")))","v":"SUN"}]
[]
[null,null,"操作パネル"]
[]
[null,null,null,null,null,null,null,null,null,null,null,null,null,null,null,null,null,null,null,null,null,null,null,null,null,null,null,null,null,null,null,null,null,null,null,null,null,null,null,null,null,null,null,null,null,null,null,null,null,null,null,null,null,null,null,null,null,"歯医者に通院、再開",null,null,null,null,1]
[null,null,null,null,null,null,null,null,null,null,null,null,null,null,null,null,null,null,null,null,null,null,null,null,null,null,null,null,null,null,null,null,null,null,null,null,null,null,null,null,null,null,null,null,null,null,null,null,null,null,null,null,null,null,null,null,null,null,null,null,null,null,1]
[null,null,"週初めの日付を選択",null,null,null,null,null,null,null,null,null,null,null,null,null,null,null,null,null,null,null,null,null,null,null,null,null,null,null,null,null,null,null,null,null,null,null,null,null,null,null,null,null,null,null,null,null,null,null,null,null,null,null,null,null,null,"英会話を学ぶ",null,null,null,null,0]
[null,null,"2014-05-12",null,null,null,null,null,null,null,null,null,null,null,null,null,null,null,null,null,null,null,null,null,null,null,null,null,null,null,null,null,null,null,null,null,null,null,null,null,null,null,null,null,null,null,null,null,null,null,null,null,null,null,null,null,null,null,null,null,null,null,0]
[null,null,null,null,null,null,null,null,null,null,null,null,null,null,null,null,null,null,null,null,null,null,null,null,null,null,null,null,null,null,null,null,null,null,null,null,null,null,null,null,null,null,null,null,null,null,null,null,null,null,null,null,null,null,null,null,null,"壊れたテーブルを修理",null,null,null,null,0]
[null,null,"Month 　　　　 Day",null,null,null,null,null,null,null,null,null,null,null,null,null,null,null,null,null,null,null,null,null,null,null,null,null,null,null,null,null,null,null,null,null,null,null,null,null,null,null,null,null,null,null,null,null,null,null,null,null,null,null,null,null,null,null,null,null,null,null,0]
[null,null,null,null,null,null,null,null,null,null,null,null,null,null,null,null,null,null,null,null,null,null,null,null,null,null,null,null,null,null,null,null,null,null,null,null,null,null,null,null,null,null,null,null,null,null,null,null,null,null,null,null,null,null,null,null,null,null,null,null,null,null,0]
[null,null,null,null,null,null,null,null,null,null,null,null,null,null,null,null,null,null,null,null,null,null,null,null,null,null,null,null,null,null,null,null,null,null,null,null,null,null,null,null,null,null,null,null,null,null,null,null,null,null,null,null,null,null,null,null,null,null,null,null,null,null,0]
[null,null,null,null,null,null,null,null,null,null,null,null,null,null,null,null,null,null,null,null,null,null,null,null,null,null,null,null,null,null,null,null,null,null,null,null,null,null,null,null,null,null,null,null,null,null,null,null,null,null,null,null,null,null,null,null,null,null,null,null,null,null,0]
[null,null,"ズーム設定の変更"]
[]
[]
[]
[]
[null,null,"シートの書き出し"]
[]
[]
[]
[]
[]
[]
[null,null,"数値入力用\nキーパッド",null,null,null,null,null,"購入リスト",null,null,null,"金額",null,null,"購入リスト",null,null,null,"金額",null,null,"購入リスト",null,null,null,"金額",null,null,"購入リスト",null,null,null,"金額",null,null,"購入リスト",null,null,null,"金額",null,null,"購入リスト",null,null,null,"金額",null,null,"購入リスト",null,null,null,"金額",null,null,"固定費など",null,null,null,"金額"]
[]
[null,null,null,null,null,null,null,null,"ヨガマット",null,null,null,1395,null,null,"ネイル代",null,null,null,8000,null,null,"歯科診療費",null,null,null,2500,null,null,null,null,null,null,null,null,null,null,null,null,null,null,null,null,null,null,null,null,null,null,null,null,null,null,null,null,null,null,"ケータイ代",null,null,null,8000]
[null,null,null,null,null,null,null,null,"外食費",null,null,null,6500,null,null,"映画のチケット",null,null,null,1800,null,null,"ジム会員費",null,null,null,3000,null,null,null,null,null,null,null,null,null,null,null,null,null,null,null,null,null,null,null,null,null,null,null,null,null,null,null,null,null,null,"インターネット",null,null,null,3000]
[null,null,null,null,null,null,null,null,"交通費",null,null,null,450,null,null,"交通費",null,null,null,920]
[]
[]
[]
[]
[]
[]
[]
[]
[]
[]
[null,null,"シートの初期化",null,null,null,null,null,"１日の支出合計",null,null,null,null,null,null,"１日の支出合計",null,null,null,null,null,null,"１日の支出合計",null,null,null,null,null,null,"１日の支出合計",null,null,null,null,null,null,"１日の支出合計",null,null,null,null,null,null,"１日の支出合計",null,null,null,null,null,null,"１日の支出合計",null,null,null,null,null,null,"１週間の支出合計"]
[]
[null,null,null,null,null,null,null,null,{"$f":"SUM(M33:M43)","v":8345},null,null,null,null,null,null,{"$f":"SUM(T33:T43)","v":10720},null,null,null,null,null,null,{"$f":"SUM(AA33:AA43)","v":5500},null,null,null,null,null,null,{"$f":"SUM(AH33:AH43)","v":0},null,null,null,null,null,null,{"$f":"SUM(AO33:AO43)","v":0},null,null,null,null,null,null,{"$f":"SUM(AV33:AV43)","v":0},null,null,null,null,null,null,{"$f":"SUM(BC33:BC43)","v":0},null,null,null,null,null,null,{"$f":"SUM(I48,P48,W48,AD48,AK48,AR48,AY48,BJ33:BJ43)","v":35565}]

{"sheet":"入力シート","index":2,"n_rows":48,"n_cols":63,"rows_kept":48,"cut":false,"hidden":false,"merged":[[7,2,9,2],[26,57,26,59],[12,2,13,2],[38,57,38,59],[39,57,39,59],[40,57,40,59],[41,57,41,59],[42,57,42,59],[45,57,45,59],[7,6,8,6],[9,6,10,6],[30,2,32,2],[32,43,32,45],[32,8,32,10],[33,8,33,10],[34,8,34,10],[35,8,35,10],[36,8,36,10],[37,8,37,10],[32,22,32,24],[33,22,33,24],[34,22,34,24],[35,22,35,24],[32,15,32,17],[47,57,47,59],[3,57,5,61],[7,57,7,59],[8,57,8,59],[9,57,9,59],[10,57,10,59],[11,57,11,59],[12,57,12,59],[13,57,13,59],[14,57,14,59],[15,57,15,59],[16,57,16,59],[17,57,17,59],[18,57,18,59],[19,57,19,59],[20,57,20,59],[21,57,21,59],[22,57,22,59],[32,57,32,59],[33,57,33,59],[34,57,34,59],[35,57,35,59],[36,57,36,59],[37,57,37,59],[2,59,2,61],[6,59,6,61],[17,6,18,6],[19,6,20,6],[30,8,30,10],[25,10,25,12],[26,10,26,12],[21,6,22,6],[11,6,12,6],[13,6,14,6],[15,6,16,6],[30,43,30,45],[23,6,24,6],[25,6,26,6],[6,10,6,12],[23,57,23,59],[24,57,24,59],[25,57,25,59],[30,57,30,59],[27,57,27,59],[30,15,30,17],[13,24,13,26],[3,17,3,19],[4,17,4,19],[47,22,47,24],[36,22,36,24],[37,22,37,24],[38,22,38,24],[39,22,39,24],[40,22,40,24],[41,22,41,24],[47,8,47,10],[38,8,38,10],[39,8,39,10],[40,8,40,10],[41,8,41,10],[42,8,42,10],[45,8,45,10],[42,15,42,17],[45,15,45,17],[47,15,47,17],[47,36,47,38],[45,29,45,31],[47,29,47,31],[30,36,30,38],[32,36,32,38],[33,36,33,38],[34,36,34,38],[35,36,35,38],[36,36,36,38],[37,36,37,38],[38,36,38,38],[37,29,37,31],[38,29,38,31],[39,29,39,31],[40,29,40,31],[41,29,41,31],[42,29,42,31],[30,29,30,31],[32,29,32,31],[36,29,36,31],[15,17,15,19],[40,15,40,17],[41,15,41,17],[11,24,11,26],[12,24,12,26],[33,15,33,17],[42,22,42,24],[45,22,45,24],[42,36,42,38],[45,36,45,38],[16,17,16,19],[17,17,17,19],[34,15,34,17],[35,15,35,17],[36,15,36,17],[37,15,37,17],[38,15,38,17],[39,15,39,17],[22,17,22,19],[23,17,23,19],[24,17,24,19],[25,17,25,19],[26,17,26,19],[27,17,27,19],[18,17,18,19],[19,17,19,19],[20,17,20,19],[21,17,21,19],[10,17,10,19],[11,17,11,19],[12,17,12,19],[47,50,47,52],[45,43,45,45],[47,43,47,45],[30,50,30,52],[32,50,32,52],[33,50,33,52],[34,50,34,52],[35,50,35,52],[36,50,36,52],[37,50,37,52],[38,50,38,52],[37,43,37,45],[38,43,38,45],[39,43,39,45],[40,43,40,45],[41,43,41,45],[42,43,42,45],[30,22,30,24],[39,50,39,52],[40,50,40,52],[41,50,41,52],[42,50,42,52],[45,50,45,52],[33,29,33,31],[34,29,34,31],[35,29,35,31],[39,36,39,38],[40,36,40,38],[41,36,41,38],[35,43,35,45],[36,43,36,45],[33,43,33,45],[34,43,34,45],[4,10,4,12],[5,10,5,12],[3,10,3,12],[2,10,2,12],[27,10,27,12],[21,10,21,12],[22,10,22,12],[17,10,17,12],[18,10,18,12],[23,10,23,12],[24,10,24,12],[19,10,19,12],[20,10,20,12],[13,10,13,12],[14,10,14,12],[15,10,15,12],[16,10,16,12],[11,10,11,12],[12,10,12,12],[7,10,7,12],[8,10,8,12],[9,10,9,12],[10,10,10,12],[14,24,14,26],[7,17,7,19],[8,17,8,19],[9,17,9,19],[2,24,2,26],[3,24,3,26],[4,24,4,26],[5,24,5,26],[6,24,6,26],[7,24,7,26],[8,24,8,26],[5,17,5,19],[6,17,6,19],[13,17,13,19],[14,17,14,19],[2,17,2,19],[27,24,27,26],[2,31,2,33],[3,31,3,33],[4,31,4,33],[5,31,5,33],[6,31,6,33],[7,31,7,33],[8,31,8,33],[9,31,9,33],[10,31,10,33],[21,24,21,26],[22,24,22,26],[23,24,23,26],[24,24,24,26],[25,24,25,26],[26,24,26,26],[15,24,15,26],[16,24,16,26],[17,24,17,26],[18,24,18,26],[19,24,19,26],[20,24,20,26],[9,24,9,26],[10,24,10,26],[2,38,2,40],[3,38,3,40],[4,38,4,40],[5,38,5,40],[6,38,6,40],[17,31,17,33],[18,31,18,33],[19,31,19,33],[20,31,20,33],[11,31,11,33],[12,31,12,33],[13,31,13,33],[14,31,14,33],[15,31,15,33],[16,31,16,33],[9,38,9,40],[10,38,10,40],[11,38,11,40],[12,38,12,40],[17,38,17,40],[18,38,18,40],[7,38,7,40],[8,38,8,40],[20,45,20,47],[9,45,9,47],[10,45,10,47],[11,45,11,47],[23,31,23,33],[24,31,24,33],[25,31,25,33],[26,31,26,33],[27,31,27,33],[21,31,21,33],[22,31,22,33],[25,38,25,40],[26,38,26,40],[27,38,27,40],[21,38,21,40],[22,38,22,40],[23,38,23,40],[24,38,24,40],[19,38,19,40],[20,38,20,40],[13,38,13,40],[14,38,14,40],[15,38,15,40],[16,38,16,40],[27,52,27,54],[17,52,17,54],[12,45,12,47],[13,45,13,47],[14,45,14,47],[11,52,11,54],[12,52,12,54],[13,52,13,54],[14,52,14,54],[15,52,15,54],[16,52,16,54],[18,52,18,54],[19,52,19,54],[20,52,20,54],[21,52,21,54],[22,52,22,54],[27,45,27,47],[21,45,21,47],[22,45,22,47],[23,45,23,47],[24,45,24,47],[17,45,17,47],[18,45,18,47],[19,45,19,47],[25,45,25,47],[26,45,26,47],[15,45,15,47],[16,45,16,47],[23,52,23,54],[2,52,2,54],[3,52,3,54],[4,52,4,54],[5,52,5,54],[6,52,6,54],[7,52,7,54],[8,52,8,54],[9,52,9,54],[10,52,10,54],[24,52,24,54],[25,52,25,54],[26,52,26,54],[2,45,2,47],[3,45,3,47],[4,45,4,47],[5,45,5,47],[6,45,6,47],[7,45,7,47],[8,45,8,47]]}
[]
[]
[]
[null,null,null,null,null,null,null,null,{"$f":"C13","v":"2014-05-12"},null,null,null,null,null,null,{"$f":"I4+1","v":"2014-05-13"},null,null,null,null,null,null,{"$f":"P4+1","v":"2014-05-14"},null,null,null,null,null,null,{"$f":"W4+1","v":"2014-05-15"},null,null,null,null,null,null,{"$f":"AD4+1","v":"2014-05-16"},null,null,null,null,null,null,{"$f":"AK4+1","v":"2014-05-17"},null,null,null,null,null,null,{"$f":"AR4+1","v":"2014-05-18"},null,null,null,null,null,null,"Weekly\nTO DO"]
[null,null,null,null,null,null,null,null,{"$f":"IF(I4=\"\",\"\",I4)","v":"2014-05-12"},null,null,null,null,null,null,{"$f":"IF(P4=\"\",\"\",P4)","v":"2014-05-13"},null,null,null,null,null,null,{"$f":"IF(W4=\"\",\"\",W4)","v":"2014-05-14"},null,null,null,null,null,null,{"$f":"IF(AD4=\"\",\"\",AD4)","v":"2014-05-15"},null,null,null,null,null,null,{"$f":"IF(AK4=\"\",\"\",AK4)","v":"2014-05-16"},null,null,null,null,null,null,{"$f":"IF(AR4=\"\",\"\",AR4)","v":"2014-05-17"},null,null,null,null,null,null,{"$f":"IF(AY4=\"\",\"\",AY4)","v":"2014-05-18"}]
[null,null,null,null,null,null,null,null,{"$f":"IF(I4=\"\",\"\",UPPER(TEXT(DATE(YEAR(I4),MONTH(I4),DAY(I4)),\"ddd\")))","v":"MON"},null,null,null,null,null,null,{"$f":"IF(P4=\"\",\"\",UPPER(TEXT(DATE(YEAR(P4),MONTH(P4),DAY(P4)),\"ddd\")))","v":"TUE"},null,null,null,null,null,null,{"$f":"IF(W4=\"\",\"\",UPPER(TEXT(DATE(YEAR(W4),MONTH(W4),DAY(W4)),\"ddd\")))","v":"WED"},null,null,null,null,null,null,{"$f":"IF(AD4=\"\",\"\",UPPER(TEXT(DATE(YEAR(AD4),MONTH(AD4),DAY(AD4)),\"ddd\")))","v":"THU"},null,null,null,null,null,null,{"$f":"IF(AK4=\"\",\"\",UPPER(TEXT(DATE(YEAR(AK4),MONTH(AK4),DAY(AK4)),\"ddd\")))","v":"FRI"},null,null,null,null,null,null,{"$f":"IF(AR4=\"\",\"\",UPPER(TEXT(DATE(YEAR(AR4),MONTH(AR4),DAY(AR4)),\"ddd\")))","v":"SAT"},null,null,null,null,null,null,{"$f":"IF(AY4=\"\",\"\",UPPER(TEXT(DATE(YEAR(AY4),MONTH(AY4),DAY(AY4)),\"ddd\")))","v":"SUN"}]
[]
[null,null,"操作パネル"]
[]
[null,null,null,null,null,null,null,null,null,null,null,null,null,null,null,null,null,null,null,null,null,null,null,null,null,null,null,null,null,null,null,null,null,null,null,null,null,null,null,null,null,null,null,null,null,null,null,null,null,null,null,null,null,null,null,null,null,null,null,null,null,null,0]
[null,null,null,null,null,null,null,null,null,null,null,null,null,null,null,null,null,null,null,null,null,null,null,null,null,null,null,null,null,null,null,null,null,null,null,null,null,null,null,null,null,null,null,null,null,null,null,null,null,null,null,null,null,null,null,null,null,null,null,null,null,null,0]
[null,null,"週初めの日付を選択",null,null,null,null,null,null,null,null,null,null,null,null,null,null,null,null,null,null,null,null,null,null,null,null,null,null,null,null,null,null,null,null,null,null,null,null,null,null,null,null,null,null,null,null,null,null,null,null,null,null,null,null,null,null,null,null,null,null,null,0]
[null,null,"2014-05-12",null,null,null,null,null,null,null,null,null,null,null,null,null,null,null,null,null,null,null,null,null,null,null,null,null,null,null,null,null,null,null,null,null,null,null,null,null,null,null,null,null,null,null,null,null,null,null,null,null,null,null,null,null,null,null,null,null,null,null,0]
[null,null,null,null,null,null,null,null,null,null,null,null,null,null,null,null,null,null,null,null,null,null,null,null,null,null,null,null,null,null,null,null,null,null,null,null,null,null,null,null,null,null,null,null,null,null,null,null,null,null,null,null,null,null,null,null,null,null,null,null,null,null,0]
[null,null,"Month 　　　　 Day",null,null,null,null,null,null,null,null,null,null,null,null,null,null,null,null,null,null,null,null,null,null,null,null,null,null,null,null,null,null,null,null,null,null,null,null,null,null,null,null,null,null,null,null,null,null,null,null,null,null,null,null,null,null,null,null,null,null,null,0]
[null,null,null,null,null,null,null,null,null,null,null,null,null,null,null,null,null,null,null,null,null,null,null,null,null,null,null,null,null,null,null,null,null,null,null,null,null,null,null,null,null,null,null,null,null,null,null,null,null,null,null,null,null,null,null,null,null,null,null,null,null,null,0]
[null,null,null,null,null,null,null,null,null,null,null,null,null,null,null,null,null,null,null,null,null,null,null,null,null,null,null,null,null,null,null,null,null,null,null,null,null,null,null,null,null,null,null,null,null,null,null,null,null,null,null,null,null,null,null,null,null,null,null,null,null,null,0]
[null,null,null,null,null,null,null,null,null,null,null,null,null,null,null,null,null,null,null,null,null,null,null,null,null,null,null,null,null,null,null,null,null,null,null,null,null,null,null,null,null,null,null,null,null,null,null,null,null,null,null,null,null,null,null,null,null,null,null,null,null,null,0]
[null,null,"ズーム設定の変更"]
[]
[]
[]
[]
[null,null,"シートの書き出し"]
[]
[]
[]
[]
[]
[]
[null,null,"数値入力用\nキーパッド",null,null,null,null,null,"購入リスト",null,null,null,"金額",null,null,"購入リスト",null,null,null,"金額",null,null,"購入リスト",null,null,null,"金額",null,null,"購入リスト",null,null,null,"金額",null,null,"購入リスト",null,null,null,"金額",null,null,"購入リスト",null,null,null,"金額",null,null,"購入リスト",null,null,null,"金額",null,null,"固定費など",null,null,null,"金額"]
[]
[]
[]
[]
[]
[]
[]
[]
[]
[]
[]
[]
[]
[]
[null,null,"シートの初期化",null,null,null,null,null,"１日の支出合計",null,null,null,null,null,null,"１日の支出合計",null,null,null,null,null,null,"１日の支出合計",null,null,null,null,null,null,"１日の支出合計",null,null,null,null,null,null,"１日の支出合計",null,null,null,null,null,null,"１日の支出合計",null,null,null,null,null,null,"１日の支出合計",null,null,null,null,null,null,"１週間の支出合計"]
[]
[null,null,null,null,null,null,null,null,{"$f":"SUM(M33:M43)","v":0},null,null,null,null,null,null,{"$f":"SUM(T33:T43)","v":0},null,null,null,null,null,null,{"$f":"SUM(AA33:AA43)","v":0},null,null,null,null,null,null,{"$f":"SUM(AH33:AH43)","v":0},null,null,null,null,null,null,{"$f":"SUM(AO33:AO43)","v":0},null,null,null,null,null,null,{"$f":"SUM(AV33:AV43)","v":0},null,null,null,null,null,null,{"$f":"SUM(BC33:BC43)","v":0},null,null,null,null,null,null,{"$f":"SUM(I48,P48,W48,AD48,AK48,AR48,AY48,BJ33:BJ43)","v":0}]

{"sheet":"祝日設定","index":3,"n_rows":102,"n_cols":1,"rows_kept":102,"cut":false,"hidden":true,"merged":[]}
["2011-01-01"]
["2011-01-10"]
["2011-02-11"]
["2011-03-21"]
["2011-04-29"]
["2011-05-03"]
["2011-05-04"]
["2011-05-05"]
["2011-07-18"]
["2011-09-19"]
["2011-09-23"]
["2011-10-10"]
["2011-11-03"]
["2011-11-23"]
["2011-12-23"]
["2011-12-30"]
["2011-12-31"]
["2012-01-01"]
["2012-01-02"]
["2012-01-09"]
["2012-02-11"]
["2012-03-20"]
["2012-04-29"]
["2012-04-30"]
["2012-05-03"]
["2012-05-04"]
["2012-05-05"]
["2012-07-16"]
["2012-09-17"]
["2012-09-22"]
["2012-10-08"]
["2012-11-03"]
["2012-11-23"]
["2012-12-23"]
["2012-12-24"]
["2013-01-01"]
["2013-01-14"]
["2013-02-11"]
["2013-03-20"]
["2013-04-29"]
["2013-05-03"]
["2013-05-04"]
["2013-05-05"]
["2013-05-06"]
["2013-07-15"]
["2013-09-16"]
["2013-09-23"]
["2013-10-14"]
["2013-11-03"]
["2013-11-04"]
["2013-11-23"]
["2013-12-23"]
["2014-01-01"]
["2014-01-13"]
["2014-02-11"]
["2014-03-21"]
["2014-04-29"]
["2014-05-03"]
["2014-05-04"]
["2014-05-05"]
["2014-05-06"]
["2014-07-21"]
["2014-09-15"]
["2014-09-23"]
["2014-10-13"]
["2014-11-03"]
["2014-11-23"]
["2014-11-24"]
["2014-12-23"]
["2015-01-01"]
["2015-01-12"]
["2015-02-11"]
["2015-03-21"]
["2015-04-29"]
["2015-05-03"]
["2015-05-04"]
["2015-05-05"]
["2015-05-06"]
["2015-07-20"]
["2015-09-21"]
["2015-09-22"]
["2015-09-23"]
["2015-10-12"]
["2015-11-03"]
["2015-11-23"]
["2015-12-23"]
["2016-01-01"]
["2016-01-11"]
["2016-02-11"]
["2016-03-20"]
["2016-03-21"]
["2016-04-29"]
["2016-05-03"]
["2016-05-04"]
["2016-05-05"]
["2016-07-18"]
["2016-09-19"]
["2016-09-22"]
["2016-10-10"]
["2016-11-03"]
["2016-11-23"]
["2016-12-23"]

{"sheet":"image","index":4,"n_rows":0,"n_cols":0,"rows_kept":0,"cut":false,"hidden":true,"merged":[]}