{"text_format":"1","workbook":"xlsx","n_sheets":4,"sheets":["ガイド","Sheet1","グラフ","calc"],"not_rendered":{"charts":0,"images":10,"macros":1,"external_links":0,"defined_names":0,"comments":0,"pivot_tables":0},"unopened":[],"bounds":{"document_bytes":16777216,"sheet_cells":100000,"rows_first":2000,"rows_last":500,"rows_between":2000,"halvings":0,"cell_chars":16384,"cell_head_chars":4096},"cells_cut":0,"cells_raw":0,"read":"whole","date_system":"1900"}

{"sheet":"ガイド","index":0,"n_rows":0,"n_cols":0,"rows_kept":0,"cut":false,"hidden":false,"merged":[]}

{"sheet":"Sheet1","index":1,"n_rows":11,"n_cols":10,"rows_kept":11,"cut":false,"hidden":false,"merged":[[8,1,10,1],[8,3,10,3],[5,5,8,6],[1,1,1,6],[2,5,2,6],[2,3,2,4],[2,1,2,2],[6,2,7,2]]}
[]
[null,1]
[null,{"$f":"calc!D15","v":24},null,{"$f":"HLOOKUP(calc!D19,calc!F18:I19,2,0)","v":"－"},null,{"$f":"calc!D23","v":5},null,null,null,43.46]
[]
[]
[null,{"$f":"HLOOKUP(calc!F31,calc!F26:I27,2,0)","v":19},null,{"$f":"HLOOKUP(calc!G31,calc!F26:I27,2,0)","v":25}]
[]
[]
[null,{"$f":"HLOOKUP(calc!H31,calc!F26:I27,2,0)","v":8},null,{"$f":"HLOOKUP(calc!I31,calc!F26:I27,2,0)","v":18}]
[null,null,null,null,null,"正解数",{"$f":"calc!O28","v":0}]
[null,null,null,null,null,"解答時間（秒）",{"$f":"calc!N28","v":"00:00:00"}]

{"sheet":"グラフ","index":2,"n_rows":74,"n_cols":13,"rows_kept":74,"cut":false,"hidden":true,"merged":[[12,3,16,6],[23,1,23,2],[23,3,23,4],[23,5,23,6],[23,7,23,8],[23,9,23,11],[24,1,24,2],[24,3,24,4],[24,5,24,6],[24,7,24,8],[24,9,24,11],[25,1,25,2],[25,3,25,4],[25,5,25,6],[25,7,25,8],[25,9,25,11],[26,1,26,2],[26,3,26,4],[26,5,26,6],[26,7,26,8],[26,9,26,11],[27,1,27,2],[27,3,27,4],[27,5,27,6],[27,7,27,8],[27,9,27,11],[28,1,28,2],[28,3,28,4],[28,5,28,6],[28,7,28,8],[28,9,28,11],[29,1,29,2],[29,3,29,4],[29,5,29,6],[29,7,29,8],[29,9,29,11],[30,1,30,2],[30,3,30,4],[30,5,30,6],[30,7,30,8],[30,9,30,11],[31,1,31,2],[31,3,31,4],[31,5,31,6],[31,7,31,8],[31,9,31,11],[32,1,32,2],[32,3,32,4],[32,5,32,6],[32,7,32,8],[32,9,32,11],[33,1,33,2],[33,3,33,4],[33,5,33,6],[33,7,33,8],[33,9,33,11],[34,1,34,2],[34,3,34,4],[34,5,34,6],[34,7,34,8],[34,9,34,11],[35,1,35,2],[35,3,35,4],[35,5,35,6],[35,7,35,8],[35,9,35,11],[36,1,36,2],[36,3,36,4],[36,5,36,6],[36,7,36,8],[36,9,36,11],[37,1,37,2],[37,3,37,4],[37,5,37,6],[37,7,37,8],[37,9,37,11],[38,1,38,2],[38,3,38,4],[38,5,38,6],[38,7,38,8],[38,9,38,11],[39,1,39,2],[39,3,39,4],[39,5,39,6],[39,7,39,8],[39,9,39,11],[40,1,40,2],[40,3,40,4],[40,5,40,6],[40,7,40,8],[40,9,40,11],[41,1,41,2],[41,3,41,4],[41,5,41,6],[41,7,41,8],[41,9,41,11],[42,1,42,2],[42,3,42,4],[42,5,42,6],[42,7,42,8],[42,9,42,11],[43,1,43,2],[43,3,43,4],[43,5,43,6],[43,7,43,8],[43,9,43,11],[44,1,44,2],[44,3,44,4],[44,5,44,6],[44,7,44,8],[44,9,44,11],[45,1,45,2],[45,3,45,4],[45,5,45,6],[45,7,45,8],[45,9,45,11],[46,1,46,2],[46,3,46,4],[46,5,46,6],[46,7,46,8],[46,9,46,11],[47,1,47,2],[47,3,47,4],[47,5,47,6],[47,7,47,8],[47,9,47,11],[48,1,48,2],[48,3,48,4],[48,5,48,6],[48,7,48,8],[48,9,48,11],[49,1,49,2],[49,3,49,4],[49,5,49,6],[49,7,49,8],[49,9,49,11],[50,1,50,2],[50,3,50,4],[50,5,50,6],[50,7,50,8],[50,9,50,11],[51,1,51,2],[51,3,51,4],[51,5,51,6],[51,7,51,8],[51,9,51,11],[52,1,52,2],[52,3,52,4],[52,5,52,6],[52,7,52,8],[52,9,52,11],[53,1,53,2],[53,3,53,4],[53,5,53,6],[53,7,53,8],[53,9,53,11],[54,1,54,2],[54,3,54,4],[54,5,54,6],[54,7,54,8],[54,9,54,11],[55,1,55,2],[55,3,55,4],[55,5,55,6],[55,7,55,8],[55,9,55,11],[56,1,56,2],[56,3,56,4],[56,5,56,6],[56,7,56,8],[56,9,56,11],[57,1,57,2],[57,3,57,4],[57,5,57,6],[57,7,57,8],[57,9,57,11],[58,1,58,2],[58,3,58,4],[58,5,58,6],[58,7,58,8],[58,9,58,11],[59,1,59,2],[59,3,59,4],[59,5,59,6],[59,7,59,8],[59,9,59,11],[60,1,60,2],[60,3,60,4],[60,5,60,6],[60,7,60,8],[60,9,60,11],[61,1,61,2],[61,3,61,4],[61,5,61,6],[61,7,61,8],[61,9,61,11],[62,1,62,2],[62,3,62,4],[62,5,62,6],[62,7,62,8],[62,9,62,11],[63,1,63,2],[63,3,63,4],[63,5,63,6],[63,7,63,8],[63,9,63,11],[64,1,64,2],[64,3,64,4],[64,5,64,6],[64,7,64,8],[64,9,64,11],[65,1,65,2],[65,3,65,4],[65,5,65,6],[65,7,65,8],[65,9,65,11],[66,1,66,2],[66,3,66,4],[66,5,66,6],[66,7,66,8],[66,9,66,11],[69,1,69,2],[69,3,69,4],[69,5,69,6],[69,7,69,8],[69,9,69,11],[67,1,67,2],[67,3,67,4],[67,5,67,6],[67,7,67,8],[67,9,67,11],[68,1,68,2],[68,3,68,4],[68,5,68,6],[68,7,68,8],[68,9,68,11],[73,9,73,11],[73,7,73,8],[73,5,73,6],[73,3,73,4],[73,1,73,2],[72,9,72,11],[72,7,72,8],[72,5,72,6],[72,3,72,4],[72,1,72,2],[71,9,71,11],[71,7,71,8],[71,5,71,6],[71,3,71,4],[71,1,71,2],[70,9,70,11],[70,7,70,8],[70,5,70,6],[70,3,70,4],[70,1,70,2]]}
[]
[]
[]
[null,"成績表グラフ"]
[]
[]
[]
[]
[]
[]
[]
[]
[null,null,null,{"$f":"H23","v":1.3757202024850439}]
[]
[]
[]
[]
[]
[]
[]
[]
[]
[null,null,null,null,null,null,null,{"$f":"MAX(IF(ISNUMBER(H25:H74),H25:H74,\"\"))","v":1.3757202024850439}]
[null,"日付",null,"正解数",null,"回答時間（秒）",null,"総合得点",null,"総合評価"]
[null,"2014-08-15",null,4,null,"00:00:43.460",null,{"$f":"IF(M25=\"\",\"\",IF(ISERROR(1730/(M25*10000000)),0, IF(1730/(M25*10000000)>=10,10,1730/(M25*10000000))))","v":1.3757202024850439},null,"Eクラス（-）",null,null,1.2575231481481481E-4]
[null,null,null,null,null,null,null,{"$f":"IF(M26=\"\",\"\",IF(ISERROR(1730/(M26*10000000)),0, IF(1730/(M26*10000000)>=10,10,1730/(M26*10000000))))","v":""}]
[null,null,null,null,null,null,null,""]
[null,null,null,null,null,null,null,""]
[null,null,null,null,null,null,null,""]
[null,null,null,null,null,null,null,""]
[null,null,null,null,null,null,null,""]
[null,null,null,null,null,null,null,""]
[null,null,null,null,null,null,null,""]
[null,null,null,null,null,null,null,""]
[null,null,null,null,null,null,null,""]
[null,null,null,null,null,null,null,""]
[null,null,null,null,null,null,null,""]
[null,null,null,null,null,null,null,""]
[null,null,null,null,null,null,null,""]
[null,null,null,null,null,null,null,""]
[null,null,null,null,null,null,null,""]
[null,null,null,null,null,null,null,""]
[null,null,null,null,null,null,null,""]
[null,null,null,null,null,null,null,""]
[null,null,null,null,null,null,null,""]
[null,null,null,null,null,null,null,""]
[null,null,null,null,null,null,null,""]
[null,null,null,null,null,null,null,""]
[null,null,null,null,null,null,null,""]
[null,null,null,null,null,null,null,""]
[null,null,null,null,null,null,null,""]
[null,null,null,null,null,null,null,""]
[null,null,null,null,null,null,null,""]
[null,null,null,null,null,null,null,""]
[null,null,null,null,null,null,null,""]
[null,null,null,null,null,null,null,""]
[null,null,null,null,null,null,null,""]
[null,null,null,null,null,null,null,""]
[null,null,null,null,null,null,null,""]
[null,null,null,null,null,null,null,""]
[null,null,null,null,null,null,null,""]
[null,null,null,null,null,null,null,""]
[null,null,null,null,null,null,null,""]
[null,null,null,null,null,null,null,""]
[null,null,null,null,null,null,null,""]
[null,null,null,null,null,null,null,""]
[null,null,null,null,null,null,null,""]
[null,null,null,null,null,null,null,""]
[null,null,null,null,null,null,null,""]
[null,null,null,null,null,null,null,""]
[null,null,null,null,null,null,null,""]
[null,null,null,null,null,null,null,""]
[null,null,null,null,null,null,null,""]
[null,null,null,null,null,null,null,""]

{"sheet":"calc","index":3,"n_rows":33,"n_cols":18,"rows_kept":33,"cut":false,"hidden":true,"merged":[[13,1,13,2],[17,1,17,2],[21,1,21,2],[25,1,25,2],[29,1,29,2]]}
[]
[]
[null,null,null,null,null,null,null,null,null,70.349999999999994]
[]
[null,null,null,null,null,null,"回答までの時間",null,"評価（正否）"]
[]
[]
[null,null,null,null,null,null,"答え",null,"評価（時間）"]
[]
[]
[]
[]
[null,"■左の数字"]
[null,"乱数の範囲",null,"発生した乱数"]
[null,10,30,{"$f":"INT(RAND()*(C15-B15)+B15)","v":24}]
[]
[null,"■演算子用",null,null,null,"■演算子",null,null,null,null,"■評価基準",null,null,"■回答",null,null,"■評価"]
[null,"乱数の範囲",null,"発生した乱数",null,1,2,3,4,null,"00:00:01",5,null,null,null,null,1.0000000000000001E-5,"Sクラス（★★★★★）"]
[null,{"$f":"IF(MOD(Sheet1!B3,Sheet1!F3),2,1)","v":2},5,{"$f":"INT(RAND()*(C19-B19)+B19)","v":4},null,"＋","＋","－","－",null,"00:00:03",4,null,null,null,null,1.4999999999999999E-5,"Aクラス（★★★★）"]
[null,null,null,null,null,null,null,null,null,null,"00:00:05",3,null,null,null,null,2.0000000000000002E-5,"Bクラス（★★★）"]
[null,"■右の数字",null,null,null,null,null,null,null,null,"00:00:07",2,null,null,null,null,3.0000000000000001E-5,"Cクラス（★★）"]
[null,"乱数の範囲",null,"発生した乱数",null,null,null,null,null,null,"それ以上",1,null,null,null,null,4.0000000000000003E-5,"Dクラス（★）"]
[null,2,6,{"$f":"INT(RAND()*(C23-B23)+B23)","v":5},null,null,null,null,null,null,null,null,null,null,null,null,"それ以上","Eクラス（-）"]
[]
[null,"■プラスマイナス5の乱数",null,null,null,"■選択肢"]
[null,"乱数の範囲",null,"発生した乱数",null,1,2,3,4]
[null,2,9,{"$f":"IF(MOD(ROUNDDOWN(RAND()*10,0),2),INT(RAND()*(C27-B27)+B27),INT(RAND()*(C27-B27)+B27)*-1)","v":6},null,{"$f":"IF(D19=1,D15+D23,IF(D19=2,D15+D23,IF(D19=3,D15-D23,D15-D23)))","v":19},{"$f":"IF(MOD(ROUNDDOWN(RAND()*10,0),2),F27+1,F27-1)","v":18},{"$f":"ROUNDDOWN(F27/2-MOD(F27,2),0)","v":8},{"$f":"F27+D27","v":25}]
[null,null,null,null,null,null,null,null,null,null,null,null,null,{"$f":"MAX(N18:N27)","v":"00:00:00"},{"$f":"COUNTIF(O18:O27,\"○\")","v":0}]
[null,"■選択肢の位置用",null,null,null,"■選択肢",null,null,null,null,null,null,null,{"$f":"N28","v":0},{"$f":"IF(ISERROR(N29/O28),9999,N29/O28)","v":9999}]
[null,"乱数の範囲",null,"発生した乱数",null,1,2,3,4]
[null,1,5,{"$f":"INT(RAND()*(C31-B31)+B31)","v":4},null,1,4,3,2]
[null,null,null,null,null,null,null,null,null,null,null,null,null,3,10]
[null,null,null,null,null,null,null,null,null,null,null,null,null,{"$f":"(N32*10)/100000","v":"00:00:25.920"},{"$f":"N33/O32","v":2.9999999999999997E-5}]