{"text_format":"1","workbook":"xlsx","n_sheets":8,"sheets":["使い方","月別","日別","開始時刻","終了時刻","休憩開始","休憩終了","設定"],"not_rendered":{"charts":1,"images":3,"macros":1,"external_links":0,"defined_names":0,"comments":0,"pivot_tables":0},"unopened":[],"bounds":{"document_bytes":16777216,"sheet_cells":100000,"rows_first":2000,"rows_last":500,"rows_between":2000,"halvings":0,"cell_chars":16384,"cell_head_chars":4096},"cells_cut":0,"cells_raw":0,"read":"whole","date_system":"1900"}

{"sheet":"使い方","index":0,"n_rows":0,"n_cols":0,"rows_kept":0,"cut":false,"hidden":false,"merged":[]}

{"sheet":"月別","index":1,"n_rows":38,"n_cols":44,"rows_kept":38,"cut":false,"hidden":false,"merged":[[7,2,7,5],[3,10,3,13],[4,10,5,13],[4,1,5,1],[4,2,5,2],[3,15,3,18],[4,15,5,18],[4,8,5,8],[3,20,3,23],[4,20,5,23]]}
[]
[]
[]
[null,null,null,null,null,"早番","通常","遅番","定休日",null,"シフト情報の登録",null,null,null,null,"月別シートの初期化",null,null,null,null,"日別シートの初期化"]
[null,2015,1,null,"開始","08:00:00","11:00:00","16:00:00","日"]
[null,null,null,null,"終了","16:00:00","19:00:00","21:00:00"]
[]
[null,"氏 名","シフト別グラフ",null,null,null,{"$f":"DATE(B5,C5,1)","v":"2015-01-01"},{"$f":"IF(ISERROR(IF(MONTH(G8+1)=MONTH(G8), G8+1,\"\")),\"\",IF(MONTH(G8+1)=MONTH(G8), G8+1,\"\"))","v":"2015-01-02"},{"$f":"IF(ISERROR(IF(MONTH(H8+1)=MONTH(H8), H8+1,\"\")),\"\",IF(MONTH(H8+1)=MONTH(H8), H8+1,\"\"))","v":"2015-01-03"},"2015-01-04","2015-01-05","2015-01-06","2015-01-07","2015-01-08","2015-01-09","2015-01-10","2015-01-11","2015-01-12","2015-01-13","2015-01-14","2015-01-15","2015-01-16","2015-01-17","2015-01-18","2015-01-19","2015-01-20","2015-01-21","2015-01-22","2015-01-23","2015-01-24","2015-01-25","2015-01-26","2015-01-27","2015-01-28","2015-01-29","2015-01-30","2015-01-31",null,{"$f":"設定!B3","v":"早番"},{"$f":"設定!B4","v":"通常"},{"$f":"設定!B5","v":"遅番"},{"$f":"設定!B6","v":"休み"},{"$f":"設定!B7","v":"定休日"},"計"]
[1,null,null,null,null,null,{"$f":"IF(G$8=\"\",\"\",IF(TEXT(WEEKDAY(G$8),\"aaa\")=設定!$C$7,設定!$B$7,\"\"))","v":""},{"$f":"IF(H$8=\"\",\"\",IF(TEXT(WEEKDAY(H$8),\"aaa\")=設定!$C$7,設定!$B$7,\"\"))","v":""},{"$f":"IF(I$8=\"\",\"\",IF(TEXT(WEEKDAY(I$8),\"aaa\")=設定!$C$7,設定!$B$7,\"\"))","v":""},{"$f":"IF(J$8=\"\",\"\",IF(TEXT(WEEKDAY(J$8),\"aaa\")=設定!$C$7,設定!$B$7,\"\"))","v":"定休日"},{"$f":"IF(K$8=\"\",\"\",IF(TEXT(WEEKDAY(K$8),\"aaa\")=設定!$C$7,設定!$B$7,\"\"))","v":""},{"$f":"IF(L$8=\"\",\"\",IF(TEXT(WEEKDAY(L$8),\"aaa\")=設定!$C$7,設定!$B$7,\"\"))","v":""},{"$f":"IF(M$8=\"\",\"\",IF(TEXT(WEEKDAY(M$8),\"aaa\")=設定!$C$7,設定!$B$7,\"\"))","v":""},{"$f":"IF(N$8=\"\",\"\",IF(TEXT(WEEKDAY(N$8),\"aaa\")=設定!$C$7,設定!$B$7,\"\"))","v":""},{"$f":"IF(O$8=\"\",\"\",IF(TEXT(WEEKDAY(O$8),\"aaa\")=設定!$C$7,設定!$B$7,\"\"))","v":""},{"$f":"IF(P$8=\"\",\"\",IF(TEXT(WEEKDAY(P$8),\"aaa\")=設定!$C$7,設定!$B$7,\"\"))","v":""},{"$f":"IF(Q$8=\"\",\"\",IF(TEXT(WEEKDAY(Q$8),\"aaa\")=設定!$C$7,設定!$B$7,\"\"))","v":"定休日"},{"$f":"IF(R$8=\"\",\"\",IF(TEXT(WEEKDAY(R$8),\"aaa\")=設定!$C$7,設定!$B$7,\"\"))","v":""},{"$f":"IF(S$8=\"\",\"\",IF(TEXT(WEEKDAY(S$8),\"aaa\")=設定!$C$7,設定!$B$7,\"\"))","v":""},{"$f":"IF(T$8=\"\",\"\",IF(TEXT(WEEKDAY(T$8),\"aaa\")=設定!$C$7,設定!$B$7,\"\"))","v":""},{"$f":"IF(U$8=\"\",\"\",IF(TEXT(WEEKDAY(U$8),\"aaa\")=設定!$C$7,設定!$B$7,\"\"))","v":""},{"$f":"IF(V$8=\"\",\"\",IF(TEXT(WEEKDAY(V$8),\"aaa\")=設定!$C$7,設定!$B$7,\"\"))","v":""},{"$f":"IF(W$8=\"\",\"\",IF(TEXT(WEEKDAY(W$8),\"aaa\")=設定!$C$7,設定!$B$7,\"\"))","v":""},{"$f":"IF(X$8=\"\",\"\",IF(TEXT(WEEKDAY(X$8),\"aaa\")=設定!$C$7,設定!$B$7,\"\"))","v":"定休日"},{"$f":"IF(Y$8=\"\",\"\",IF(TEXT(WEEKDAY(Y$8),\"aaa\")=設定!$C$7,設定!$B$7,\"\"))","v":""},{"$f":"IF(Z$8=\"\",\"\",IF(TEXT(WEEKDAY(Z$8),\"aaa\")=設定!$C$7,設定!$B$7,\"\"))","v":""},{"$f":"IF(AA$8=\"\",\"\",IF(TEXT(WEEKDAY(AA$8),\"aaa\")=設定!$C$7,設定!$B$7,\"\"))","v":""},{"$f":"IF(AB$8=\"\",\"\",IF(TEXT(WEEKDAY(AB$8),\"aaa\")=設定!$C$7,設定!$B$7,\"\"))","v":""},{"$f":"IF(AC$8=\"\",\"\",IF(TEXT(WEEKDAY(AC$8),\"aaa\")=設定!$C$7,設定!$B$7,\"\"))","v":""},{"$f":"IF(AD$8=\"\",\"\",IF(TEXT(WEEKDAY(AD$8),\"aaa\")=設定!$C$7,設定!$B$7,\"\"))","v":""},{"$f":"IF(AE$8=\"\",\"\",IF(TEXT(WEEKDAY(AE$8),\"aaa\")=設定!$C$7,設定!$B$7,\"\"))","v":"定休日"},{"$f":"IF(AF$8=\"\",\"\",IF(TEXT(WEEKDAY(AF$8),\"aaa\")=設定!$C$7,設定!$B$7,\"\"))","v":""},{"$f":"IF(AG$8=\"\",\"\",IF(TEXT(WEEKDAY(AG$8),\"aaa\")=設定!$C$7,設定!$B$7,\"\"))","v":""},{"$f":"IF(AH$8=\"\",\"\",IF(TEXT(WEEKDAY(AH$8),\"aaa\")=設定!$C$7,設定!$B$7,\"\"))","v":""},{"$f":"IF(AI$8=\"\",\"\",IF(TEXT(WEEKDAY(AI$8),\"aaa\")=設定!$C$7,設定!$B$7,\"\"))","v":""},{"$f":"IF(AJ$8=\"\",\"\",IF(TEXT(WEEKDAY(AJ$8),\"aaa\")=設定!$C$7,設定!$B$7,\"\"))","v":""},{"$f":"IF(AK$8=\"\",\"\",IF(TEXT(WEEKDAY(AK$8),\"aaa\")=設定!$C$7,設定!$B$7,\"\"))","v":""},null,{"$f":"COUNTIF($G9:$AK9,AM$8)","v":0},{"$f":"COUNTIF($G9:$AK9,AN$8)","v":0},{"$f":"COUNTIF($G9:$AK9,AO$8)","v":0},{"$f":"COUNTIF($G9:$AK9,AP$8)","v":0},{"$f":"COUNTIF($G9:$AK9,AQ$8)","v":4},{"$f":"SUM(AM9:AQ9)","v":4}]
[2,null,null,null,null,null,{"$f":"IF(G$8=\"\",\"\",IF(TEXT(WEEKDAY(G$8),\"aaa\")=設定!$C$7,設定!$B$7,\"\"))","v":""},{"$f":"IF(H$8=\"\",\"\",IF(TEXT(WEEKDAY(H$8),\"aaa\")=設定!$C$7,設定!$B$7,\"\"))","v":""},{"$f":"IF(I$8=\"\",\"\",IF(TEXT(WEEKDAY(I$8),\"aaa\")=設定!$C$7,設定!$B$7,\"\"))","v":""},{"$f":"IF(J$8=\"\",\"\",IF(TEXT(WEEKDAY(J$8),\"aaa\")=設定!$C$7,設定!$B$7,\"\"))","v":"定休日"},{"$f":"IF(K$8=\"\",\"\",IF(TEXT(WEEKDAY(K$8),\"aaa\")=設定!$C$7,設定!$B$7,\"\"))","v":""},{"$f":"IF(L$8=\"\",\"\",IF(TEXT(WEEKDAY(L$8),\"aaa\")=設定!$C$7,設定!$B$7,\"\"))","v":""},{"$f":"IF(M$8=\"\",\"\",IF(TEXT(WEEKDAY(M$8),\"aaa\")=設定!$C$7,設定!$B$7,\"\"))","v":""},{"$f":"IF(N$8=\"\",\"\",IF(TEXT(WEEKDAY(N$8),\"aaa\")=設定!$C$7,設定!$B$7,\"\"))","v":""},{"$f":"IF(O$8=\"\",\"\",IF(TEXT(WEEKDAY(O$8),\"aaa\")=設定!$C$7,設定!$B$7,\"\"))","v":""},{"$f":"IF(P$8=\"\",\"\",IF(TEXT(WEEKDAY(P$8),\"aaa\")=設定!$C$7,設定!$B$7,\"\"))","v":""},{"$f":"IF(Q$8=\"\",\"\",IF(TEXT(WEEKDAY(Q$8),\"aaa\")=設定!$C$7,設定!$B$7,\"\"))","v":"定休日"},{"$f":"IF(R$8=\"\",\"\",IF(TEXT(WEEKDAY(R$8),\"aaa\")=設定!$C$7,設定!$B$7,\"\"))","v":""},{"$f":"IF(S$8=\"\",\"\",IF(TEXT(WEEKDAY(S$8),\"aaa\")=設定!$C$7,設定!$B$7,\"\"))","v":""},{"$f":"IF(T$8=\"\",\"\",IF(TEXT(WEEKDAY(T$8),\"aaa\")=設定!$C$7,設定!$B$7,\"\"))","v":""},{"$f":"IF(U$8=\"\",\"\",IF(TEXT(WEEKDAY(U$8),\"aaa\")=設定!$C$7,設定!$B$7,\"\"))","v":""},{"$f":"IF(V$8=\"\",\"\",IF(TEXT(WEEKDAY(V$8),\"aaa\")=設定!$C$7,設定!$B$7,\"\"))","v":""},{"$f":"IF(W$8=\"\",\"\",IF(TEXT(WEEKDAY(W$8),\"aaa\")=設定!$C$7,設定!$B$7,\"\"))","v":""},{"$f":"IF(X$8=\"\",\"\",IF(TEXT(WEEKDAY(X$8),\"aaa\")=設定!$C$7,設定!$B$7,\"\"))","v":"定休日"},{"$f":"IF(Y$8=\"\",\"\",IF(TEXT(WEEKDAY(Y$8),\"aaa\")=設定!$C$7,設定!$B$7,\"\"))","v":""},{"$f":"IF(Z$8=\"\",\"\",IF(TEXT(WEEKDAY(Z$8),\"aaa\")=設定!$C$7,設定!$B$7,\"\"))","v":""},{"$f":"IF(AA$8=\"\",\"\",IF(TEXT(WEEKDAY(AA$8),\"aaa\")=設定!$C$7,設定!$B$7,\"\"))","v":""},{"$f":"IF(AB$8=\"\",\"\",IF(TEXT(WEEKDAY(AB$8),\"aaa\")=設定!$C$7,設定!$B$7,\"\"))","v":""},{"$f":"IF(AC$8=\"\",\"\",IF(TEXT(WEEKDAY(AC$8),\"aaa\")=設定!$C$7,設定!$B$7,\"\"))","v":""},{"$f":"IF(AD$8=\"\",\"\",IF(TEXT(WEEKDAY(AD$8),\"aaa\")=設定!$C$7,設定!$B$7,\"\"))","v":""},{"$f":"IF(AE$8=\"\",\"\",IF(TEXT(WEEKDAY(AE$8),\"aaa\")=設定!$C$7,設定!$B$7,\"\"))","v":"定休日"},{"$f":"IF(AF$8=\"\",\"\",IF(TEXT(WEEKDAY(AF$8),\"aaa\")=設定!$C$7,設定!$B$7,\"\"))","v":""},{"$f":"IF(AG$8=\"\",\"\",IF(TEXT(WEEKDAY(AG$8),\"aaa\")=設定!$C$7,設定!$B$7,\"\"))","v":""},{"$f":"IF(AH$8=\"\",\"\",IF(TEXT(WEEKDAY(AH$8),\"aaa\")=設定!$C$7,設定!$B$7,\"\"))","v":""},{"$f":"IF(AI$8=\"\",\"\",IF(TEXT(WEEKDAY(AI$8),\"aaa\")=設定!$C$7,設定!$B$7,\"\"))","v":""},{"$f":"IF(AJ$8=\"\",\"\",IF(TEXT(WEEKDAY(AJ$8),\"aaa\")=設定!$C$7,設定!$B$7,\"\"))","v":""},{"$f":"IF(AK$8=\"\",\"\",IF(TEXT(WEEKDAY(AK$8),\"aaa\")=設定!$C$7,設定!$B$7,\"\"))","v":""},null,{"$f":"COUNTIF($G10:$AK10,AM$8)","v":0},0,0,0,4,{"$f":"SUM(AM10:AQ10)","v":4}]
{"$rows_left_out":29}
{"sheet":"日別","index":2,"n_rows":39,"n_cols":41,"rows_kept":39,"cut":false,"hidden":false,"merged":[[3,7,3,11],[4,7,5,11],[4,1,5,1],[4,2,5,2],[4,3,5,3],[3,4,3,5],[4,4,5,5]]}
[]
[]
[]
[null,null,null,null,"日付の調節",null,null,"シフト情報の登録"]
[null,2015,1,1]
[]
[]
[null,"氏 名","開始時刻","終了時刻","休憩開始","休憩終了","07:00:00",{"$f":"G8+1/48","v":"07:30:00"},{"$f":"H8+1/48","v":"08:00:00"},"08:30:00","09:00:00","09:30:00","10:00:00","10:30:00","11:00:00","11:30:00","12:00:00","12:30:00","13:00:00","13:30:00","14:00:00","14:30:00","15:00:00","15:30:00","16:00:00","16:30:00","17:00:00","17:30:00","18:00:00","18:30:00","19:00:00","19:30:00","20:00:00","20:30:00","21:00:00","21:30:00","22:00:00","22:30:00","23:00:00","23:30:00",1.0000000000000007]
[1,"ああ",{"$f":"IF(ISBLANK(INDIRECT(ADDRESS(MATCH($C$5,INDIRECT(C$8&\"!$B$1:$B$354\"),0)+$A9,$D$5+2,4,1,C$8))),\"\",INDIRECT(ADDRESS(MATCH($C$5,INDIRECT(C$8&\"!$B$1:$B$354\"),0)+$A9,$D$5+2,4,1,C$8)))","v":""},"","","",{"$f":"IF(OR($C9=\"\",$D9=\"\",$E9=\"\",$F9=\"\"),\"\",IF($C9=\"休み\",\"\",IF(AND(AND(G$8>=$C9-(1/288),G$8<=($D9-((1/48)-(1/288)))),NOT(AND(G$8>=$E9-(1/288),G$8<=($F9-((1/48)-(1/288)))))),1,\"\")))","v":""},{"$f":"IF(OR($C9=\"\",$D9=\"\",$E9=\"\",$F9=\"\"),\"\",IF($C9=\"休み\",\"\",IF(AND(AND(H$8>=$C9-(1/288),H$8<=($D9-((1/48)-(1/288)))),NOT(AND(H$8>=$E9-(1/288),H$8<=($F9-((1/48)-(1/288)))))),1,\"\")))","v":""},"","","","","","","","","","","","","","","",{"$f":"IF(OR($C9=\"\",$D9=\"\",$E9=\"\",$F9=\"\"),\"\",IF($C9=\"休み\",\"\",IF(AND(AND(X$8>=$C9-(1/288),X$8<=($D9-((1/48)-(1/288)))),NOT(AND(X$8>=$E9-(1/288),X$8<=($F9-((1/48)-(1/288)))))),1,\"\")))","v":""},"","","","","","","","","","","","","","","",{"$f":"IF(OR($C9=\"\",$D9=\"\",$E9=\"\",$F9=\"\"),\"\",IF($C9=\"休み\",\"\",IF(AND(AND(AN$8>=$C9-(1/288),AN$8<=($D9-((1/48)-(1/288)))),NOT(AND(AN$8>=$E9-(1/288),AN$8<=($F9-((1/48)-(1/288)))))),1,\"\")))","v":""},""]
[2,{"$f":"IF(月別!B10=\"\",\"\",月別!B10)","v":""},"","","","",{"$f":"IF(OR($C10=\"\",$D10=\"\",$E10=\"\",$F10=\"\"),\"\",IF($C10=\"休み\",\"\",IF(AND(AND(G$8>=$C10-(1/288),G$8<=($D10-((1/48)-(1/288)))),NOT(AND(G$8>=$E10-(1/288),G$8<=($F10-((1/48)-(1/288)))))),1,\"\")))","v":""},"","","","","","","","","","","","","","","","","","","","","","","","","","","","","","","","","",""]
{"$rows_left_out":30}
{"sheet":"開始時刻","index":3,"n_rows":384,"n_cols":34,"rows_kept":384,"cut":false,"hidden":true,"merged":[]}
[]
[null,1,{"$f":"DATE(月別!$B$5,B2,1)","v":"2015-01-01"},{"$f":"IF(ISERROR(IF(MONTH(C2+1)=MONTH(C2), C2+1,\"\")),\"\",IF(MONTH(C2+1)=MONTH(C2), C2+1,\"\"))","v":"2015-01-02"},{"$f":"IF(ISERROR(IF(MONTH(D2+1)=MONTH(D2), D2+1,\"\")),\"\",IF(MONTH(D2+1)=MONTH(D2), D2+1,\"\"))","v":"2015-01-03"},"2015-01-04","2015-01-05","2015-01-06","2015-01-07","2015-01-08","2015-01-09","2015-01-10","2015-01-11","2015-01-12","2015-01-13","2015-01-14","2015-01-15","2015-01-16","2015-01-17","2015-01-18","2015-01-19","2015-01-20","2015-01-21","2015-01-22","2015-01-23","2015-01-24","2015-01-25","2015-01-26","2015-01-27","2015-01-28","2015-01-29","2015-01-30","2015-01-31",{"$f":"IF(ISERROR(IF(MONTH(AG2+1)=MONTH(AG2), AG2+1,\"\")),\"\",IF(MONTH(AG2+1)=MONTH(AG2), AG2+1,\"\"))","v":""}]
[null,"user_01"]
[null,"user_02"]
[null,"user_03"]
[null,"user_04"]
[null,"user_05"]
[null,"user_06"]
[null,"user_07"]
[null,"user_08"]
{"$rows_left_out":375}
{"sheet":"終了時刻","index":4,"n_rows":384,"n_cols":33,"rows_kept":384,"cut":false,"hidden":true,"merged":[]}
[]
[null,1,{"$f":"DATE(月別!$B$5,B2,1)","v":"2015-01-01"},{"$f":"IF(ISERROR(IF(MONTH(C2+1)=MONTH(C2), C2+1,\"\")),\"\",IF(MONTH(C2+1)=MONTH(C2), C2+1,\"\"))","v":"2015-01-02"},{"$f":"IF(ISERROR(IF(MONTH(D2+1)=MONTH(D2), D2+1,\"\")),\"\",IF(MONTH(D2+1)=MONTH(D2), D2+1,\"\"))","v":"2015-01-03"},"2015-01-04","2015-01-05","2015-01-06","2015-01-07","2015-01-08","2015-01-09","2015-01-10","2015-01-11","2015-01-12","2015-01-13","2015-01-14","2015-01-15","2015-01-16","2015-01-17","2015-01-18","2015-01-19","2015-01-20","2015-01-21","2015-01-22","2015-01-23","2015-01-24","2015-01-25","2015-01-26","2015-01-27","2015-01-28","2015-01-29","2015-01-30","2015-01-31"]
[null,"user_01"]
[null,"user_02"]
[null,"user_03"]
[null,"user_04"]
[null,"user_05"]
[null,"user_06"]
[null,"user_07"]
[null,"user_08"]
{"$rows_left_out":375}
{"sheet":"休憩開始","index":5,"n_rows":384,"n_cols":33,"rows_kept":384,"cut":false,"hidden":true,"merged":[]}
[]
[null,1,{"$f":"DATE(月別!$B$5,B2,1)","v":"2015-01-01"},{"$f":"IF(ISERROR(IF(MONTH(C2+1)=MONTH(C2), C2+1,\"\")),\"\",IF(MONTH(C2+1)=MONTH(C2), C2+1,\"\"))","v":"2015-01-02"},{"$f":"IF(ISERROR(IF(MONTH(D2+1)=MONTH(D2), D2+1,\"\")),\"\",IF(MONTH(D2+1)=MONTH(D2), D2+1,\"\"))","v":"2015-01-03"},"2015-01-04","2015-01-05","2015-01-06","2015-01-07","2015-01-08","2015-01-09","2015-01-10","2015-01-11","2015-01-12","2015-01-13","2015-01-14","2015-01-15","2015-01-16","2015-01-17","2015-01-18","2015-01-19","2015-01-20","2015-01-21","2015-01-22","2015-01-23","2015-01-24","2015-01-25","2015-01-26","2015-01-27","2015-01-28","2015-01-29","2015-01-30","2015-01-31"]
[null,"user_01"]
[null,"user_02"]
[null,"user_03"]
[null,"user_04"]
[null,"user_05"]
[null,"user_06"]
[null,"user_07"]
[null,"user_08"]
{"$rows_left_out":375}
{"sheet":"休憩終了","index":6,"n_rows":384,"n_cols":33,"rows_kept":384,"cut":false,"hidden":true,"merged":[]}
[]
[null,1,{"$f":"DATE(月別!$B$5,B2,1)","v":"2015-01-01"},{"$f":"IF(ISERROR(IF(MONTH(C2+1)=MONTH(C2), C2+1,\"\")),\"\",IF(MONTH(C2+1)=MONTH(C2), C2+1,\"\"))","v":"2015-01-02"},{"$f":"IF(ISERROR(IF(MONTH(D2+1)=MONTH(D2), D2+1,\"\")),\"\",IF(MONTH(D2+1)=MONTH(D2), D2+1,\"\"))","v":"2015-01-03"},"2015-01-04","2015-01-05","2015-01-06","2015-01-07","2015-01-08","2015-01-09","2015-01-10","2015-01-11","2015-01-12","2015-01-13","2015-01-14","2015-01-15","2015-01-16","2015-01-17","2015-01-18","2015-01-19","2015-01-20","2015-01-21","2015-01-22","2015-01-23","2015-01-24","2015-01-25","2015-01-26","2015-01-27","2015-01-28","2015-01-29","2015-01-30","2015-01-31"]
[null,"user_01"]
[null,"user_02"]
[null,"user_03"]
[null,"user_04"]
[null,"user_05"]
[null,"user_06"]
[null,"user_07"]
[null,"user_08"]
{"$rows_left_out":375}
{"sheet":"設定","index":7,"n_rows":356,"n_cols":11,"rows_kept":356,"cut":false,"hidden":true,"merged":[]}
[]
[null,null,"リスト情報",null,null,"祝日設定",null,"月リスト",null,"時リスト","分リスト"]
[null,{"$f":"月別!F4","v":"早番"},{"$f":"月別!F5","v":"08:00:00"},{"$f":"月別!F6","v":"16:00:00"},null,"2013-01-01",null,1,null,7,0]
[null,{"$f":"月別!G4","v":"通常"},{"$f":"月別!G5","v":"11:00:00"},{"$f":"月別!G6","v":"19:00:00"},null,"2013-01-14",null,2,null,8,30]
[null,{"$f":"月別!H4","v":"遅番"},{"$f":"月別!H5","v":"16:00:00"},{"$f":"月別!H6","v":"21:00:00"},null,"2013-02-11",null,3,null,9]
[null,"休み","-",null,null,"2013-03-20",null,4,null,10]
[null,{"$f":"月別!I4","v":"定休日"},{"$f":"月別!I5","v":"日"},null,null,"2013-04-29",null,5,null,11]
[null,null,null,null,null,"2013-05-03",null,6,null,12]
[null,null,null,null,null,"2013-05-04",null,7,null,13]
[null,null,null,null,null,"2013-05-05",null,8,null,14]
{"$rows_left_out":346}