{"text_format":"1","workbook":"xlsx","n_sheets":9,"sheets":["Disclaimer","Likelihood Definition","Impact Definition","Ent Risk Appetite","Cloud candidate template  Sheet","As is template sheet","Summary dashboard","A worked example-Hybrid","VLookup"],"not_rendered":{"charts":0,"images":1,"macros":1,"external_links":1,"defined_names":70,"comments":2,"pivot_tables":0},"unopened":[],"bounds":{"document_bytes":16777216,"sheet_cells":100000,"rows_first":2000,"rows_last":500,"rows_between":2000,"halvings":0,"cell_chars":16384,"cell_head_chars":4096},"cells_cut":0,"cells_raw":0,"read":"whole","date_system":"1900"}

{"sheet":"Disclaimer","index":0,"n_rows":15,"n_cols":2,"rows_kept":15,"cut":false,"hidden":false,"merged":[]}
[]
[null,"Disclaimer"]
[null,"This document has been prepared by Microsoft to provide an overarching risk-management framework to allow organisations to conduct a risk-based assessment of a move to the cloud."]
[null,"This document is provided on an “as is” basis and to the maximum extent permitted by law Microsoft disclaims all conditions, warranties and guarantees, express or implied, including but not limited to any warranty or guarantee that the use of the framework set out in this document will not infringe any rights or any warranty or guarantee of merchantability or fitness for a particular purpose. Before using the framework set out in this document, you should evaluate its suitability for your organisation. In particular, if you choose to act upon the output of the framework, then you do so at your own risk."]
[null,"© Microsoft"]
[null,"Apart from any use permitted under the Copyright Act 1968, and the rights explicitly granted below, all rights are reserved."]
[]
[null,"Licence: This document is licensed under a Creative Commons Attribution Non-Commercial 3.0 licence. You are free to copy, distribute and transmit the work as long as you attribute the authors. You may not use this work for commercial purposes. "]
[null,"To view a copy of this licence, visit http://creativecommons.org/licenses/by-nc/3.0/au/legalcode"]
[]
{"$rows_left_out":6}
{"sheet":"Likelihood Definition","index":1,"n_rows":11,"n_cols":6,"rows_kept":11,"cut":false,"hidden":false,"merged":[[4,1,4,2],[4,3,4,5]]}
[]
[]
[]
[]
[null,null,null,"Definition"]
[null,"Score","Likelihood Rating","Consideration","Probability","Frequency"]
[null,5,"Expected","The risk event or circumstance is relatively certain to occur, or has occurred within the past 6 months","90-100%","Almost Quarterly"]
[null,4,"Highly Likely","The risk event or circumstance is highly likely to occur","70-90%","Yearly"]
[null,3,"Likely","The risk event or circumstance is more likely to occur than not","50-70%","Every 2 to 4 Years"]
[null,2,"Not Likely","The risk event or circumstance occurring is possible","10-50%","Every 4 to 6 Years"]
{"$rows_left_out":2}
{"sheet":"Impact Definition","index":2,"n_rows":13,"n_cols":8,"rows_kept":13,"cut":false,"hidden":false,"merged":[[6,1,7,1],[6,2,7,2],[6,3,7,3],[6,4,6,7],[12,4,12,7]]}
[]
[]
[]
[]
[]
[]
[null,"Score","Rating","Definition","                  Description of Impact"]
[null,null,null,null,"Duration","Organizational and operational scope","Reputational impact on stakeholders (i.e., citizens, civil servants )","Legal/ Compliance/ Environmental Impact"]
[null,5,"Catastrophic","Severe or complete damage to asset or reputation e.g. externally visible and affects department's operation and citizen's confidence. Substantial support costs or business commitments canceled.","Significant Recovery Period","Government-wide: Inability to continue operation globally","Permanent loss of  stakeholder confidence  resulting in legal action, interruption in  operations as a whole","Global restrictions on performing activities across agencies and departments"]
[null,4,"Severe","Serious but not complete damage to asset or reputation e.g. externally visible and affects department's operation and citizen's confidence. Substantial support costs or business commitments canceled.","Recoverable in the Long Term (i.e., 12-24 months)","2 or more departments/agencies Significant, ongoing interruptions to  operations within 2 or more departments/agencies","Sustained operation degradation for citizens or preventing civil servant from meeting their SLA","Prohibited from conducting operations  in certain departments or geographies."]
{"$rows_left_out":4}
{"sheet":"Ent Risk Appetite","index":3,"n_rows":54,"n_cols":36,"rows_kept":54,"cut":false,"hidden":false,"merged":[[46,1,51,1],[5,1,5,3],[7,1,16,1],[18,1,25,1],[27,1,44,1]]}
[]
[]
[]
[]
[]
[null,"Enterprise Risk Appetite",null,null,null,null,null,null,null,null,null,null,null,null,null,null,null,null,null,null,null,null,null,null,null,"Ranking calcs"]
[null,null,"Risk Control Area","Description","Risk Likelihood","Risk Impact","Risk product"]
[null,"Compliance Risks","Governance & Entreprise Risk Management","Lack of effective internal information security governance, risk management and compliance, and alignment with the  provider own security governance","Expected","Serious",{"$f":"IF(ISNUMBER(AB8),VLOOKUP(AB8,VLookup!$A$23:$B$47,2,FALSE),\"\")","v":"Moderate"},null,null,null,null,null,null,null,null,null,null,null,null,null,null,null,null,null,null,{"$f":"IF(ISTEXT(E8),VLOOKUP(E8,VLookup!$A$2:$B$6,2,\"FALSE\"),\"\")","v":5},{"$f":"IF(ISTEXT(F8),VLOOKUP(F8,VLookup!$A$13:$B$17,2,\"False\"),\"\")","v":3},{"$f":"IF(AND(ISTEXT(E8),ISTEXT(F8)),(Z8*AA8),\"\")","v":15},null,null,null,null,null,{"$f":"IF(ISTEXT(#REF!),VLOOKUP(#REF!,VLookup!$A$2:$B$6,2,\"FALSE\"),\"\")","v":""},{"$f":"IF(ISTEXT(#REF!),VLOOKUP(#REF!,VLookup!$A$13:$B$17,2,\"False\"),\"\")","v":""},{"$f":"IF(AND(ISTEXT(#REF!),ISTEXT(#REF!)),(AH8*AI8),\"\")","v":""}]
[null,null,"Legal Issues : Contracts and Electronic Discovery","Storage, processing, disclosure to third-party, transfer to other legal jurisdictions of personal data and the risk for the provider not being able to produce business data in case of subpoena.","Highly Likely","Low",{"$f":"IF(ISNUMBER(AB9),VLOOKUP(AB9,VLookup!$A$23:$B$47,2,FALSE),\"\")","v":"Very low"},null,null,null,null,null,null,null,null,null,null,null,null,null,null,null,null,null,null,{"$f":"IF(ISTEXT(E9),VLOOKUP(E9,VLookup!$A$2:$B$6,2,\"FALSE\"),\"\")","v":4},{"$f":"IF(ISTEXT(F9),VLOOKUP(F9,VLookup!$A$13:$B$17,2,\"False\"),\"\")","v":1},4,null,null,null,null,null,{"$f":"IF(ISTEXT(#REF!),VLOOKUP(#REF!,VLookup!$A$2:$B$6,2,\"FALSE\"),\"\")","v":""},{"$f":"IF(ISTEXT(#REF!),VLOOKUP(#REF!,VLookup!$A$13:$B$17,2,\"False\"),\"\")","v":""},{"$f":"IF(AND(ISTEXT(#REF!),ISTEXT(#REF!)),(AH9*AI9),\"\")","v":""}]
[null,null,"Incident Response","Failure for the provider to detect, handle incidents and report them to the DoCE with data that can be analyzed easily to satisfy legal requirements in case of forensic investigations","Likely","Serious",{"$f":"IF(ISNUMBER(AB10),VLOOKUP(AB10,VLookup!$A$23:$B$47,2,FALSE),\"\")","v":"Low"},null,null,null,null,null,null,null,null,null,null,null,null,null,null,null,null,null,null,{"$f":"IF(ISTEXT(E10),VLOOKUP(E10,VLookup!$A$2:$B$6,2,\"FALSE\"),\"\")","v":3},{"$f":"IF(ISTEXT(F10),VLOOKUP(F10,VLookup!$A$13:$B$17,2,\"False\"),\"\")","v":3},9,null,null,null,null,null,{"$f":"IF(ISTEXT(#REF!),VLOOKUP(#REF!,VLookup!$A$2:$B$6,2,\"FALSE\"),\"\")","v":""},{"$f":"IF(ISTEXT(#REF!),VLOOKUP(#REF!,VLookup!$A$13:$B$17,2,\"False\"),\"\")","v":""},{"$f":"IF(AND(ISTEXT(#REF!),ISTEXT(#REF!)),(AH10*AI10),\"\")","v":""}]
{"$rows_left_out":45}
{"sheet":"Cloud candidate template  Sheet","index":4,"n_rows":53,"n_cols":31,"rows_kept":53,"cut":false,"hidden":false,"merged":[[4,28,4,30],[4,24,4,26],[4,1,4,3],[45,1,50,1],[4,8,4,10],[4,12,4,13],[6,1,15,1],[17,1,24,1],[26,1,43,1]]}
[]
[]
[null,"Cloud Candidate Risk Assessment - [ name of proposed cloud option here]"]
[null,null,null,null,null,null,null,null,null,null,null,null,null,null,null,null,null,null,null,null,null,null,null,null,"Ranking calcs"]
[null,"Enterprise Cloud Risk Dashboard",null,null,null,null,null,null,"Compensating Controls",null,null,null,"Residual Risks",null,null,"Results",null,null,null,null,null,null,null,null,"RAW INPUT CALCS",null,null,null,"RAW+COMP CALCS"]
[null,null,"Risk Control Area","Description","Risk Likelihood","Risk Impact","Risk product",null,"Mitigation Description","Risk Likelihood","Risk Impact",null,"Risk Likelihood","Risk Impact",null,"Final Risk position",null,null,null,null,null,null,null,null,"Liklihood number","Impact number","Factored result",null,"Liklihood number","Impact number","Factored result"]
[null,"Compliance Risks","Governance & Entreprise Risk Management","Lack of effective internal information security governance, risk management and compliance, and alignment with the  provider own security governance","Not Likely","Catastrophic",{"$f":"IF(ISNUMBER(AA7),VLOOKUP(AA7,VLookup!$A$23:$B$47,2,FALSE),\"\")","v":"Low"},null,null,null,null,null,{"$f":"IF(ISBLANK(J7),IF(ISBLANK(E7),\"\",E7),J7)","v":"Not Likely"},{"$f":"IF(ISBLANK(K7),IF(ISBLANK(F7),\"\",F7),K7)","v":"Catastrophic"},null,{"$f":"IF(ISNUMBER(AE7),VLOOKUP(AE7,VLookup!$A$23:$B$47,2,FALSE),\"\")","v":"Low"},null,null,null,null,null,null,null,null,{"$f":"IF(ISTEXT(E7),VLOOKUP(E7,VLookup!$A$2:$B$6,2,\"FALSE\"),\"\")","v":2},{"$f":"IF(ISTEXT(F7),VLOOKUP(F7,VLookup!$A$13:$B$17,2,\"False\"),\"\")","v":5},{"$f":"IF(AND(ISTEXT(M7),ISTEXT(N7)),(Y7*Z7),\"\")","v":10},null,{"$f":"IF(ISTEXT(M7),VLOOKUP(M7,VLookup!$A$2:$B$6,2,\"FALSE\"),\"\")","v":2},{"$f":"IF(ISTEXT(N7),VLOOKUP(N7,VLookup!$A$13:$B$17,2,\"False\"),\"\")","v":5},{"$f":"IF(AND(ISTEXT(M7),ISTEXT(N7)),(AC7*AD7),\"\")","v":10}]
[null,null,"Legal Issues : Contracts and Electronic Discovery","Storage, processing, disclosure to third-party, transfer to other legal jurisdictions of personal data and the risk for the provider not being able to produce business data in case of subpoena.",null,null,{"$f":"IF(ISNUMBER(AA8),VLOOKUP(AA8,VLookup!$A$23:$B$47,2,FALSE),\"\")","v":""},null,null,null,null,null,{"$f":"IF(ISBLANK(J8),IF(ISBLANK(E8),\"\",E8),J8)","v":""},{"$f":"IF(ISBLANK(K8),IF(ISBLANK(F8),\"\",F8),K8)","v":""},null,{"$f":"IF(ISNUMBER(AE8),VLOOKUP(AE8,VLookup!$A$23:$B$47,2,FALSE),\"\")","v":""},null,null,null,null,null,null,null,null,{"$f":"IF(ISTEXT(E8),VLOOKUP(E8,VLookup!$A$2:$B$6,2,\"FALSE\"),\"\")","v":""},{"$f":"IF(ISTEXT(F8),VLOOKUP(F8,VLookup!$A$13:$B$17,2,\"False\"),\"\")","v":""},{"$f":"IF(AND(ISTEXT(E8),ISTEXT(F8)),(Y8*Z8),\"\")","v":""},null,{"$f":"IF(ISTEXT(M8),VLOOKUP(M8,VLookup!$A$2:$B$6,2,\"FALSE\"),\"\")","v":{"$error":"#N/A"}},{"$f":"IF(ISTEXT(N8),VLOOKUP(N8,VLookup!$A$13:$B$17,2,\"False\"),\"\")","v":{"$error":"#N/A"}},{"$f":"IF(AND(ISTEXT(M8),ISTEXT(N8)),(AC8*AD8),\"\")","v":{"$error":"#N/A"}}]
[null,null,"Incident Response","Failure for the provider to detect, handle incidents and report them to the DoCE with data that can be analyzed easily to satisfy legal requirements in case of forensic investigations",null,null,{"$f":"IF(ISNUMBER(AA9),VLOOKUP(AA9,VLookup!$A$23:$B$47,2,FALSE),\"\")","v":""},null,null,{"$f":"IF(ISBLANK(G9), B9, G9)","v":""},null,null,{"$f":"IF(ISBLANK(J9),IF(ISBLANK(E9),\"\",E9),J9)","v":""},{"$f":"IF(ISBLANK(K9),IF(ISBLANK(F9),\"\",F9),K9)","v":""},null,{"$f":"IF(ISNUMBER(AE9),VLOOKUP(AE9,VLookup!$A$23:$B$47,2,FALSE),\"\")","v":""},null,null,null,null,null,null,null,null,{"$f":"IF(ISTEXT(E9),VLOOKUP(E9,VLookup!$A$2:$B$6,2,\"FALSE\"),\"\")","v":""},{"$f":"IF(ISTEXT(F9),VLOOKUP(F9,VLookup!$A$13:$B$17,2,\"False\"),\"\")","v":""},"",null,{"$f":"IF(ISTEXT(M9),VLOOKUP(M9,VLookup!$A$2:$B$6,2,\"FALSE\"),\"\")","v":{"$error":"#N/A"}},{"$f":"IF(ISTEXT(N9),VLOOKUP(N9,VLookup!$A$13:$B$17,2,\"False\"),\"\")","v":{"$error":"#N/A"}},{"$error":"#N/A"}]
[null,null,"Storage of data in multiple jurisdictions and lack of transparency","Mirroring data for delivery and redundant storage without actualized information as to where the data is stored. DoCE may unknowingly violate regulations especially if clear information is not provided about the jurisdiction of storage",null,null,{"$f":"IF(ISNUMBER(AA10),VLOOKUP(AA10,VLookup!$A$23:$B$47,2,FALSE),\"\")","v":""},null,null,"",null,null,"","",null,{"$f":"IF(ISNUMBER(AE10),VLOOKUP(AE10,VLookup!$A$23:$B$47,2,FALSE),\"\")","v":""},null,null,null,null,null,null,null,null,{"$f":"IF(ISTEXT(E10),VLOOKUP(E10,VLookup!$A$2:$B$6,2,\"FALSE\"),\"\")","v":""},{"$f":"IF(ISTEXT(F10),VLOOKUP(F10,VLookup!$A$13:$B$17,2,\"False\"),\"\")","v":""},"",null,{"$f":"IF(ISTEXT(M10),VLOOKUP(M10,VLookup!$A$2:$B$6,2,\"FALSE\"),\"\")","v":{"$error":"#N/A"}},{"$f":"IF(ISTEXT(N10),VLOOKUP(N10,VLookup!$A$13:$B$17,2,\"False\"),\"\")","v":{"$error":"#N/A"}},{"$error":"#N/A"}]
{"$rows_left_out":44}
{"sheet":"As is template sheet","index":5,"n_rows":54,"n_cols":29,"rows_kept":54,"cut":false,"hidden":false,"merged":[[46,1,51,1],[5,1,5,3],[7,1,16,1],[18,1,25,1],[27,1,44,1]]}
[]
[]
[]
[null,"Optional Risk Assessment for existing capability (if any exists) - [ name of existing capability here]"]
[]
[null,"Target Risk Dashboard",null,null,null,null,null,null,null,null,null,null,null,null,null,null,null,null,"Ranking calcs"]
[null,null,"Risk Control Area","Description","Risk Likelihood","Risk Impact","Risk product"]
[null,"Compliance Risks","Governance & Entreprise Risk Management","Lack of effective internal information security governance, risk management and compliance, and alignment with the  provider own security governance","Likely","Serious",{"$f":"IF(ISNUMBER(U8),VLOOKUP(U8,VLookup!$A$23:$B$47,2,FALSE),\"\")","v":"Low"},null,null,null,null,null,null,null,null,null,null,null,{"$f":"IF(ISTEXT(E8),VLOOKUP(E8,VLookup!$A$2:$B$6,2,\"FALSE\"),\"\")","v":3},{"$f":"IF(ISTEXT(F8),VLOOKUP(F8,VLookup!$A$13:$B$17,2,\"False\"),\"\")","v":3},{"$f":"IF(AND(ISTEXT(E8),ISTEXT(F8)),(S8*T8),\"\")","v":9},null,null,null,null,null,{"$f":"IF(ISTEXT(#REF!),VLOOKUP(#REF!,VLookup!$A$2:$B$6,2,\"FALSE\"),\"\")","v":""},{"$f":"IF(ISTEXT(#REF!),VLOOKUP(#REF!,VLookup!$A$13:$B$17,2,\"False\"),\"\")","v":""},{"$f":"IF(AND(ISTEXT(#REF!),ISTEXT(#REF!)),(AA8*AB8),\"\")","v":""}]
[null,null,"Legal Issues : Contracts and Electronic Discovery","Storage, processing, disclosure to third-party, transfer to other legal jurisdictions of personal data and the risk for the provider not being able to produce business data in case of subpoena.","Expected","Serious",{"$f":"IF(ISNUMBER(U9),VLOOKUP(U9,VLookup!$A$23:$B$47,2,FALSE),\"\")","v":"Moderate"},null,null,null,null,null,null,null,null,null,null,null,{"$f":"IF(ISTEXT(E9),VLOOKUP(E9,VLookup!$A$2:$B$6,2,\"FALSE\"),\"\")","v":5},{"$f":"IF(ISTEXT(F9),VLOOKUP(F9,VLookup!$A$13:$B$17,2,\"False\"),\"\")","v":3},15,null,null,null,null,null,{"$f":"IF(ISTEXT(#REF!),VLOOKUP(#REF!,VLookup!$A$2:$B$6,2,\"FALSE\"),\"\")","v":""},{"$f":"IF(ISTEXT(#REF!),VLOOKUP(#REF!,VLookup!$A$13:$B$17,2,\"False\"),\"\")","v":""},{"$f":"IF(AND(ISTEXT(#REF!),ISTEXT(#REF!)),(AA9*AB9),\"\")","v":""}]
[null,null,"Incident Response","Failure for the provider to detect, handle incidents and report them to the DoCE with data that can be analyzed easily to satisfy legal requirements in case of forensic investigations","Likely","Severe",{"$f":"IF(ISNUMBER(U10),VLOOKUP(U10,VLookup!$A$23:$B$47,2,FALSE),\"\")","v":"Moderate"},null,null,null,null,null,null,null,null,null,null,null,{"$f":"IF(ISTEXT(E10),VLOOKUP(E10,VLookup!$A$2:$B$6,2,\"FALSE\"),\"\")","v":3},{"$f":"IF(ISTEXT(F10),VLOOKUP(F10,VLookup!$A$13:$B$17,2,\"False\"),\"\")","v":4},12,null,null,null,null,null,{"$f":"IF(ISTEXT(#REF!),VLOOKUP(#REF!,VLookup!$A$2:$B$6,2,\"FALSE\"),\"\")","v":""},{"$f":"IF(ISTEXT(#REF!),VLOOKUP(#REF!,VLookup!$A$13:$B$17,2,\"False\"),\"\")","v":""},{"$f":"IF(AND(ISTEXT(#REF!),ISTEXT(#REF!)),(AA10*AB10),\"\")","v":""}]
{"$rows_left_out":45}
{"sheet":"Summary dashboard","index":6,"n_rows":52,"n_cols":12,"rows_kept":52,"cut":false,"hidden":false,"merged":[[5,1,14,1],[16,1,23,1],[25,1,42,1],[44,1,49,1]]}
[]
[]
[]
[]
[null,null,"Risk Control Area",null,"Ent Risk Tolerance",null,null,"As is",null,"Cloud proposal",null,"Alternative B"]
[null,"Compliance Risks","Governance & Entreprise Risk Management",null,{"$f":"'Ent Risk Appetite'!G8","v":"Moderate"},null,null,{"$f":"'As is template sheet'!G8","v":"Low"},null,{"$f":"'Cloud candidate template  Sheet'!P7","v":"Low"}]
[null,null,"Legal Issues : Contracts and Electronic Discovery",null,{"$f":"'Ent Risk Appetite'!G9","v":"Very low"},null,null,{"$f":"'As is template sheet'!G9","v":"Moderate"},null,{"$f":"'Cloud candidate template  Sheet'!P8","v":""}]
[null,null,"Incident Response",null,{"$f":"'Ent Risk Appetite'!G10","v":"Low"},null,null,{"$f":"'As is template sheet'!G10","v":"Moderate"},null,{"$f":"'Cloud candidate template  Sheet'!P9","v":""}]
[null,null,"Storage of data in multiple jurisdictions and lack of transparency",null,{"$f":"'Ent Risk Appetite'!G11","v":"Very low"},null,null,{"$f":"'As is template sheet'!G11","v":"High"},null,{"$f":"'Cloud candidate template  Sheet'!P10","v":""}]
[null,null,"Compliance and Audit Management",null,{"$f":"'Ent Risk Appetite'!G12","v":"Low"},null,null,{"$f":"'As is template sheet'!G12","v":"Moderate"},null,{"$f":"'Cloud candidate template  Sheet'!P11","v":""}]
{"$rows_left_out":43}
{"sheet":"A worked example-Hybrid","index":7,"n_rows":51,"n_cols":29,"rows_kept":51,"cut":false,"hidden":false,"merged":[[2,26,2,28],[43,1,48,1],[2,7,2,9],[2,11,2,12],[4,1,13,1],[15,1,22,1],[24,1,41,1]]}
[null,"Example analysis based on the worked example of Department of Citizen Engagement in the \"Cloud Risk Decision Framework\" fieldbook",null,null,null,null,null,null,null,null,null,null,null,null,null,null,null,null,null,null,null,null,null,null,null,null,"Ranking calcs"]
[]
[null,null,null,null,null,null,null,"Compensating Controls",null,null,null,"Residual Risks",null,null,null,null,null,null,null,null,null,null,null,null,null,null,"RAW INPUT CALCS"]
[null,null,"Risk Control Area","Description","Risk Likelihood","Risk Impact",null,"Mitigation Description","Risk Likelihood","Risk Impact",null,"Risk Likelihood","Risk Impact","RISK PRODUCT",null,null,null,null,null,null,null,null,null,null,null,null,"Liklihood number","Impact number","Factored result"]
[null,"Compliance Risks","Governance & Entreprise Risk Management","Lack of effective internal information security governance, risk management and compliance, and alignement with the  provider own security governance","Likely","Mild",null,"Cloud Solution  ISO27001 certified and externally audited","Likely","Mild",null,{"$f":"IF(ISBLANK(I5), E5, I5)","v":"Likely"},{"$f":"IF(ISBLANK(J5), F5, J5)","v":"Mild"},{"$f":"IF(ISNUMBER(AA5),VLOOKUP(AC5,VLookup!$A$23:$B$47,2,FALSE),\"\")","v":"Low"},null,null,null,null,null,null,null,null,null,null,null,null,{"$f":"IF(ISTEXT(L5),VLOOKUP(L5,VLookup!$A$2:$B$6,2,\"FALSE\"),\"\")","v":3},{"$f":"IF(ISTEXT(J5),VLOOKUP(J5,VLookup!$A$13:$B$17,2,\"False\"),\"\")","v":2},{"$f":"IF(AND(ISTEXT(L5),ISTEXT(M5)),(AA5*AB5),\"\")","v":6}]
[null,null,"Legal Issues : Contracts and Electronic Discovery","Storage, processing, disclosure to third-party, transfer to other legal jurisdictions of personal data and the risk for the provider not being able to produce business data in case of subpoena.","Expected","Severe",null,"Can be addressed by segmenting the mails systems that need to remain on-premice or on private cloud","Slight","Severe",null,{"$f":"IF(ISBLANK(I6), E6, I6)","v":"Slight"},"Severe",{"$f":"IF(ISNUMBER(AA6),VLOOKUP(AC6,VLookup!$A$23:$B$47,2,FALSE),\"\")","v":"Very low"},null,null,null,null,null,null,null,null,null,null,null,null,{"$f":"IF(ISTEXT(L6),VLOOKUP(L6,VLookup!$A$2:$B$6,2,\"FALSE\"),\"\")","v":1},{"$f":"IF(ISTEXT(J6),VLOOKUP(J6,VLookup!$A$13:$B$17,2,\"False\"),\"\")","v":4},{"$f":"IF(AND(ISTEXT(L6),ISTEXT(M6)),(AA6*AB6),\"\")","v":4}]
[null,null,"Incident Response","Failure for the provider to detect, handle incidents and report them to the DoCE with data that can be analyzed easily to satisfy legal requirements in case of forensic investigations","Likely","Serious",null,"Cloud Solution  ISO27001 certified and externally audited + Contractual SLA","Highly likely","Mild",null,"Highly likely","Mild",{"$f":"IF(ISNUMBER(AA7),VLOOKUP(AC7,VLookup!$A$23:$B$47,2,FALSE),\"\")","v":"Low"},null,null,null,null,null,null,null,null,null,null,null,null,{"$f":"IF(ISTEXT(L7),VLOOKUP(L7,VLookup!$A$2:$B$6,2,\"FALSE\"),\"\")","v":4},{"$f":"IF(ISTEXT(J7),VLOOKUP(J7,VLookup!$A$13:$B$17,2,\"False\"),\"\")","v":2},8]
[null,null,"Storage of data in multiple jurisdictions and lack of transparency","Mirroring data for delivery and redundant storage without actualized information as to where the data is stored. DoCE may unknowingly violate regulations especially if clear information is not provided about the jurisdiction of storage","Expected","Serious",null,"Can be addressed by segmenting the mails systems that need to remain on-premice or on private cloud","Not Likely","Mild",null,"Not Likely","Mild",{"$f":"IF(ISNUMBER(AA8),VLOOKUP(AC8,VLookup!$A$23:$B$47,2,FALSE),\"\")","v":"Very low"},null,null,null,null,null,null,null,null,null,null,null,null,{"$f":"IF(ISTEXT(L8),VLOOKUP(L8,VLookup!$A$2:$B$6,2,\"FALSE\"),\"\")","v":2},{"$f":"IF(ISTEXT(J8),VLOOKUP(J8,VLookup!$A$13:$B$17,2,\"False\"),\"\")","v":2},4]
[null,null,"Compliance and Audit Management","Risk of failing to comply with government-mandated and industry-specific regulations and standards, and failure to get audit information from the  provider","Likely","Serious",null,"Cloud Solution complianf with regulations ABC and XYZ in DoCE Country","Not Likely","Mild",null,"Not Likely","Mild",{"$f":"IF(ISNUMBER(AA9),VLOOKUP(AC9,VLookup!$A$23:$B$47,2,FALSE),\"\")","v":"Very low"},null,null,null,null,null,null,null,null,null,null,null,null,{"$f":"IF(ISTEXT(L9),VLOOKUP(L9,VLookup!$A$2:$B$6,2,\"FALSE\"),\"\")","v":2},{"$f":"IF(ISTEXT(J9),VLOOKUP(J9,VLookup!$A$13:$B$17,2,\"False\"),\"\")","v":2},4]
[null,null,"Data Protection Risks","Risk of adequate Data Protection no longer being maintained to a compliant level","Likely","Serious",null,"Cloud Solution  ISO27001 certified and externally audited + Contractual SLA","Not Likely","Serious",null,"Not Likely","Serious",{"$f":"IF(ISNUMBER(AA10),VLOOKUP(AC10,VLookup!$A$23:$B$47,2,FALSE),\"\")","v":"Low"},null,null,null,null,null,null,null,null,null,null,null,null,{"$f":"IF(ISTEXT(L10),VLOOKUP(L10,VLookup!$A$2:$B$6,2,\"FALSE\"),\"\")","v":2},{"$f":"IF(ISTEXT(J10),VLOOKUP(J10,VLookup!$A$13:$B$17,2,\"False\"),\"\")","v":3},6]
{"$rows_left_out":42}
{"sheet":"VLookup","index":8,"n_rows":47,"n_cols":14,"rows_kept":47,"cut":false,"hidden":false,"merged":[]}
["LIKELIHOOD"]
["Expected",5,null,"Lookup tables used in other sheets"]
["Highly likely",4]
["Likely",3]
["Not likely",2]
["Slight",1]
[]
[]
[]
[]
{"$rows_left_out":37}